{"text_format":"3","workbook":"xlsx","n_sheets":10,"sheets":["Frontsheet","Character Equipment","Character Stats","Equipment List","Skill List","Initial Skills","Tables","Choosers","Crunch","Revisions"],"not_rendered":{"macros":1,"defined_names":216},"read":"whole","date_system":"1900"}

{"sheet":"Frontsheet","index":0,"n_rows":70,"n_cols":56,"rows_kept":70,"merged":[[0,22,0,24],[9,9,9,10],[10,9,10,10],[11,9,11,10],[19,16,19,17],[20,16,20,17],[23,1,23,2],[23,4,23,5],[23,7,23,8],[23,10,23,11],[23,13,23,14],[23,16,23,17],[24,1,24,2],[24,4,24,5],[24,7,24,8],[24,10,24,11],[24,13,24,14],[24,16,24,17],[25,0,26,0],[27,0,28,0],[33,5,33,6],[66,0,68,0]]}
["Character:",null,null,{"$f":"character_name","v":"TBA"},{"$nulls":8},"Player: ",null,{"$f":"player_name","v":"4.2 Beta"},{"$nulls":4},"Date Gen'd",null,null,{"$f":"'Character Stats'!L2","v":"2015-08-19T15:38:35.760"}]
[]
["Intelligence",{"$nulls":3},{"$f":"intelligence","v":5},null,"Speech",{"$nulls":3},{"$f":"speech","v":12},null,"Gender",{"$nulls":3},{"$f":"sex_disp","v":"Male"},null,null,"Skills"]
["Wisdom",{"$nulls":3},{"$f":"wisdom","v":15},null,"Appearance",{"$nulls":3},{"$f":"appearance","v":11},null,"Race",{"$nulls":3},{"$f":"race_disp","v":"Human"},null,null,{"$f":"IF(AI23>0,INDIRECT(CONCATENATE(\"'Character Stats'!a\",AJ23)),\"\")","v":"Two Edge Blades"},{"$nulls":4},{"$f":"IF(AI23>0,INDIRECT(CONCATENATE(\"'Character Stats'!f\",AJ23)),\"\")","v":2}]
["Constitution",{"$nulls":3},{"$f":"constitution","v":5},null,"Art",{"$nulls":3},{"$f":"art","v":6},null,"Size",{"$nulls":3},{"$f":"size1","v":10},{"$f":"size2","v":13},null,"Mounted Lance",{"$nulls":4},1]
["Strength",{"$nulls":3},{"$f":"strength","v":16},null,"Ethics",{"$nulls":3},{"$f":"ethics","v":2},null,"Horoscope",{"$nulls":3},{"$f":"horoscope_disp","v":"Pisces"},null,null,"Single Edge Blades",{"$nulls":4},1]
["Dexterity",{"$nulls":3},{"$f":"dexterity","v":22},null,"Faith",{"$nulls":3},{"$f":"faith","v":8},null,"Social Status",{"$nulls":3},{"$f":"VLOOKUP(social_status,Tables!A317:B325,2)","v":"Townsman"},null,null,"Shields",{"$nulls":4},2]
[{"$nulls":19},"Dodge",{"$nulls":4},1]
["Stealth",{"$nulls":3},{"$f":"stealth","v":16},null,"Height",null,null,{"$f":"height_ft","v":{"v":5,"d":"5 ft"}},{"$f":"height_in","v":8},null,"Complexion",{"$nulls":3},{"$f":"IF('Character Stats'!L36=\"\",\"\",'Character Stats'!L36)","v":""},null,null,"Tackle",{"$nulls":4},1]
["Combat",{"$nulls":3},{"$f":"combat","v":16},null,"Weight",null,null,{"$f":"weight","v":190},null,"lb","Eye Color",{"$nulls":3},{"$f":"IF('Character Stats'!L37=\"\",\"\",'Character Stats'!L37)","v":""},null,null,{"$f":"IF(AI29>0,INDIRECT(CONCATENATE(\"'Character Stats'!a\",AJ29)),\"\")","v":"Grapple"},{"$nulls":4},{"$f":"IF(AI29>0,INDIRECT(CONCATENATE(\"'Character Stats'!f\",AJ29)),\"\")","v":1}]
{"$rows_left_out":53}
{"sheet":"Character Equipment","index":1,"n_rows":56,"n_cols":21,"rows_kept":56,"merged":[[2,17,2,18],[3,20,6,20],[4,2,4,3],[7,1,7,4],[7,11,7,14],[8,1,8,4],[8,11,8,14],[9,11,9,14],[10,11,10,14],[11,1,11,4],[11,11,11,14],[12,1,12,4],[12,11,12,14],[15,1,15,4],[15,11,15,14],[16,11,16,14],[17,11,17,14],[18,11,18,14]]}
["Enter the Equipment Item # from the equipment list in the green field.  For general equipment enter the quantity, for weapons enter any plus's "]
[]
["Character Name",null,null,{"$f":"character_name","v":"TBA"},{"$nulls":4},"Player Name",null,{"$f":"player_name","v":"4.2 Beta"},{"$nulls":5},"Date ",{"$f":"NOW()","v":"2015-08-19T15:38:35.760"}]
[{"$nulls":20},"OPT: Restrict weapon choices by type. Then choose weapon."]
["Equipment Cost",null,{"$f":"SUM(G8:G53)+SUM(Q8:Q53)","v":1113},null,null,"Total Carried Weight",null,null,{"$f":"SUM(F8:F53)+SUM(P8:P53)","v":{"v":149.25,"d":"149.3"}},"lb",null,"Combat Carried Weight",null,null,{"$f":"I5-(SUM(J21:J53)+SUM(T21:T53))","v":{"v":149.25,"d":"149.3"}},"lb"]
[{"$nulls":5},"Total Encumberance",null,null,{"$f":"I5/carryingcap","v":{"v":0.4753184713375796,"d":"48%"}},null,null,"Combat Encumberance","Encumberance",null,{"$f":"O5/carryingcap","v":{"v":0.4753184713375796,"d":"48%"}}]
["Body Armour",null,null,"Description",null,"Weight","Cost",null,"Magic +",null,"Melee Weapons",null,null,"Description",null,"Weight","Cost","Size","Magic +"]
[{"$f":"IF(B8=\"\",\"\",VLOOKUP(B8,Armorcode,2))","v":9},"Cuirass",{"$nulls":3},{"$f":"IF(A8=\"\",\"\",VLOOKUP(A8,body_armour_table,5)*weight)","v":57},{"$f":"IF(A8=\"\",\"\",VLOOKUP(A8,body_armour_table,4))","v":200},{"$nulls":3},{"$f":"IF(L8=\"\",\"\",VLOOKUP(L8,weaponcode,2))","v":37},"Short Sword",{"$nulls":3},{"$f":"IF(K8=\"\",\"\",VLOOKUP(K8,weapons_table,5))","v":5},{"$f":"IF(K8=\"\",\"\",VLOOKUP(K8,weapons_table,4))","v":65},{"$f":"IF(K8=\"\",\"\",VLOOKUP(K8,weapons_table,7))","v":3},null,{"$f":"IF(ISERROR(VLOOKUP(VLOOKUP('Character Equipment'!K8,weapons_table,26),character_skill_table,6,FALSE)),0,VLOOKUP(VLOOKUP('Character Equipment'!K8,weapons_table,26),character_skill_table,6,FALSE))","v":0},"All Weapons"]
[{"$f":"IF(B9=\"\",\"\",VLOOKUP(B9,Surcoatcode,2))","v":14},"None",{"$nulls":3},{"$f":"IF(A9=\"\",\"\",IF(A9>12,VLOOKUP(A9,body_armour_table,5)*weight,\"\"))","v":0},{"$f":"IF(A9=\"\",\"\",VLOOKUP(A9,body_armour_table,4))","v":0},{"$nulls":3},66,"Warhammer",{"$nulls":3},10,50,5,null,{"$f":"IF(ISERROR(VLOOKUP(VLOOKUP('Character Equipment'!K9,weapons_table,26),character_skill_table,6,FALSE)),0,VLOOKUP(VLOOKUP('Character Equipment'!K9,weapons_table,26),character_skill_table,6,FALSE))","v":0},"Hammers"]
[{"$nulls":10},72,"Maul",{"$nulls":3},12,75,8,null,{"$f":"IF(ISERROR(VLOOKUP(VLOOKUP('Character Equipment'!K10,weapons_table,26),character_skill_table,6,FALSE)),0,VLOOKUP(VLOOKUP('Character Equipment'!K10,weapons_table,26),character_skill_table,6,FALSE))","v":0},"Hammers"]
{"$rows_left_out":47}
{"sheet":"Character Stats","index":2,"n_rows":89,"n_cols":42,"rows_kept":89,"merged":[[0,1,0,4],[1,1,1,4],[1,11,1,12],[1,13,1,14],[20,4,20,5],[20,12,20,13],[29,11,29,12],[30,11,30,12],[31,11,31,12],[32,11,32,12],[33,11,33,12],[34,11,34,12],[35,11,35,12],[36,11,36,12],[37,11,37,12],[39,10,39,12],[40,10,40,12]]}
["Character Name:","TBA",{"$nulls":7},"Gen'd?",null,0,"Change this value from zero when character is generated"]
["Player Name:","4.2 Beta",{"$nulls":7},"Date",null,{"$f":"IF(L1<>0,L2,N2)","v":"2015-08-19T15:38:35.760"},null,{"$f":"NOW()","v":42235.65180277778}]
[{"$f":"IF(A9=\"\",IF(C9=0,IF(K9=\"\",IF(K15=\"\",IF(A15=\"\",Z10,Z9),Z6),Z5),IF(C9>0,Z7,Z8)),Z4)","v":"Character attributes are correct."},null,"Base","Mods","Bonus","Score","Exp Cost",{"$nulls":5},"Base","Mods","Score"]
["Intelligence     (1-20)",{"$f":"IF(OR((E4>1),OR(C4>20,C4<1)),\"X\",\"\")","v":""},5,{"$f":"VLOOKUP(horoscope_stat,Horoscope,3)+VLOOKUP(race_stat,Race,3)","v":0},null,{"$f":"IF(E4>0,C4+D4+1,C4+D4)","v":5},{"$f":"IF(E4>0,500,0)","v":0},{"$nulls":3},"Speech",{"$f":"IF(OR(M4>20,M4<2),\"X\",\"\")","v":""},{"$f":"IF(L1<>0,M4,P4)","v":12},{"$f":"VLOOKUP(horoscope_stat,Horoscope,8)+VLOOKUP(race_stat,Race,8)","v":0},{"$f":"MAXA(IF(C4+10<M4+N4,C4+10,M4+N4),1)","v":12},{"$f":"TRUNC(RAND()*10+1)+TRUNC(RAND()*10+1)","v":12},{"$nulls":9},"A Selected Attribute is out of range."]
[{"$f":"\"Wisdom           (1-\"&TEXT(MIN(C4+10,20),0)&\")\"","v":"Wisdom           (1-15)"},{"$f":"IF(OR((E5>1),OR(C5>MIN(C4+10,20),C5<1)),\"X\",\"\")","v":""},15,{"$f":"IF(OR(LEFT(N10,1)=\"f\",LEFT(N10,1)=\"F\"),1,0)+VLOOKUP(horoscope_stat,Horoscope,4)+VLOOKUP(race_stat,Race,4)-IF(C4+10<C5,C5-H5)","v":0},null,{"$f":"IF(E5>0,C5+D5+1,C5+D5)","v":15},{"$f":"IF(E5>0,500,0)","v":0},{"$f":"MIN(C4+10,20)","v":15},null,null,"Appearance",{"$f":"IF(OR(M5>20,M5<2),\"X\",\"\")","v":""},{"$f":"IF(L1<>0,M5,P5)","v":11},{"$f":"VLOOKUP(horoscope_stat,Horoscope,9)+VLOOKUP(race_stat,Race,9)","v":0},{"$f":"MAXA(M5+N5,1)","v":11},{"$f":"TRUNC(RAND()*10+1)+TRUNC(RAND()*10+1)","v":11},{"$nulls":9},"A Random Attribute exceeds its allowed range."]
["Constitution     (1-20)",{"$f":"IF(OR((E6>1),OR(C6>20,C6<1)),\"X\",\"\")","v":""},5,{"$f":"VLOOKUP(horoscope_stat,Horoscope,5)+VLOOKUP(race_stat,Race,5)","v":0},null,{"$f":"IF(E6>0,C6+D6+1,C6+D6)","v":5},{"$f":"IF(E6>0,500,0)","v":0},{"$nulls":3},"Art",{"$f":"IF(OR(M6>20,M6<2),\"X\",\"\")","v":""},{"$f":"IF(L1<>0,M6,P6)","v":5},{"$f":"VLOOKUP(horoscope_stat,Horoscope,10)+VLOOKUP(race_stat,Race,10)","v":1},{"$f":"MAXA(IF((OR((C4+10<M6+N6),(C5+10<M6+N6))),MINA(C4,C5)+10,M6+N6),1)","v":6},{"$f":"TRUNC(RAND()*10+1)+TRUNC(RAND()*10+1)","v":5},{"$nulls":9},"Race, Size and/or Horoscope values exceed allowed ranges."]
[{"$f":"\"Strength          (1-\"&TEXT(MIN(C6+10,20),0)&\")\"","v":"Strength          (1-15)"},{"$f":"IF(OR((E7>1),OR(C7>MIN(C6+10,20),C7<1)),\"X\",\"\")","v":""},15,{"$f":"IF(OR(LEFT(N10,1)=\"f\",LEFT(N10,1)=\"F\"),-2,0)+VLOOKUP(horoscope_stat,Horoscope,6)+VLOOKUP(race_stat,Race,6)-IF(C6+10<C7,C7-H7)","v":1},null,{"$f":"IF(E7>0,C7+D7+1,C7+D7)","v":16},{"$f":"IF(E7>0,500,0)","v":0},{"$f":"MIN(C6+10,20)","v":15},null,{"$f":"ROUNDUP(IF(strength<4,-1,IF(strength>20,((strength-20)/2+1),(IF(strength>18,1,0)))),0)","v":0},"Ethics",{"$f":"IF(OR(M7>10,M7<1),\"X\",\"\")","v":""},{"$f":"IF(L1<>0,M7,P7)","v":2},{"$f":"VLOOKUP(horoscope_stat,Horoscope,11)+VLOOKUP(race_stat,Race,11)","v":0},{"$f":"MAXA(M7+N7,1)","v":2},{"$f":"TRUNC(RAND()*10)+1","v":2},{"$nulls":9},"Selected Attributes total greater than 60 points."]
["Dexterity          (1-20)",{"$f":"IF(OR((E8>1),OR(C8>20,C8<1)),\"X\",\"\")","v":""},20,{"$f":"IF(OR(LEFT(N10,1)=\"f\",LEFT(N10,1)=\"F\"),1,0)+VLOOKUP(horoscope_stat,Horoscope,7)+VLOOKUP(race_stat,Race,7)","v":2},null,{"$f":"IF(E8>0,C8+D8+1,C8+D8)","v":22},{"$f":"IF(E8>0,500,0)","v":0},{"$nulls":3},"Faith",{"$f":"IF(OR(M8>10,M8<1),\"X\",\"\")","v":""},{"$f":"IF(L1<>0,M8,P8)","v":8},{"$f":"VLOOKUP(horoscope_stat,Horoscope,12)+VLOOKUP(race_stat,Race,12)","v":0},{"$f":"MAXA(M8+N8,1)","v":8},{"$f":"TRUNC(RAND()*10)+1","v":8},{"$nulls":9},"Selected Attributes total less than 60 points."]
[{"$f":"IF(OR(OR(OR(OR(B4=\"X\",B5=\"X\"),B6=\"X\"),B7=\"X\"),B8=\"X\"),\"INVALID\",\"\")","v":""},null,{"$f":"SUM(C4:C8)-60","v":0},{"$f":"HLOOKUP(size1,Build,IF(OR(LEFT(N10,1)=\"f\",LEFT(N10,1)=\"F\"),2,1)+1)","v":2},null,{"$f":"HLOOKUP(size2,Stature,2*(VLOOKUP(race_stat,Race,17)))","v":68},{"$nulls":4},{"$f":"IF(OR(OR(OR(OR(L4=\"X\",L5=\"X\"),L6=\"X\"),L7=\"X\"),L8=\"X\"),\"INVALID\",\"\")","v":""},{"$nulls":14},"Body or Stamia exceeds allowed range"]
["Charisma",{"$nulls":4},{"$f":"ROUND((intelligence+wisdom+constitution+speech+appearance)/5,0)+E10","v":10},{"$f":"IF(E10>0,(VLOOKUP(F10-1,attrib_cost_table,2)-VLOOKUP(F10-E10-1,attrib_cost_table,2)),0)","v":0},{"$nulls":3},"Gender",null,{"$f":"IF(L1<>0,M10,P10)","v":34},{"$f":"IF(gender_stat<61,\"Male\",\"Female\")","v":"Male"},null,{"$f":"TRUNC(RAND()*100)+1","v":34},{"$nulls":9},"Character attributes are correct."]
{"$rows_left_out":80}
{"sheet":"Equipment List","index":3,"n_rows":407,"n_cols":32,"rows_kept":407}
[null,"EQUIPMENT TABLE"]
["Item","Body Armour","Class","Cost","Weight","Dodge Mod",{"$nulls":20},"Body Armour","Item"]
[1,"None",0,0,0,-1,{"$nulls":20},"Banded",7]
[{"$f":"A3+1","v":2},"Leather",1,10,0.1,-1,{"$nulls":20},"Chain and Plate",12]
[{"$f":"A4+1","v":3},"Cuir-Boulli",2,45,0.15,0,{"$nulls":20},"Chain Mail",8]
[4,"Quilt",2,60,0.1,0,{"$nulls":20},"Cuirass",9]
[5,"Scale",3,50,0.2,0,{"$nulls":20},"Cuir-Boulli",3]
[6,"Splint",3,65,0.2,0,{"$nulls":20},"Leather",2]
[7,"Banded",4,80,0.25,0,{"$nulls":20},"Mail Armour",10]
[8,"Chain Mail",5,150,0.25,0,{"$nulls":20},"None",1]
{"$rows_left_out":398}
{"sheet":"Skill List","index":4,"n_rows":462,"n_cols":18,"rows_kept":462}
[null,"Skill Table"]
["#","Methods",{"$nulls":3},"Type"]
[1,"Essence Method",null,null,{"$f":"A3","v":1},"M"]
[{"$f":"A3+1","v":2},"Enchantment Method",null,null,2,"M"]
[3,"Word Method",null,null,3,"M"]
[4,"Prayer Method",null,null,4,"M"]
[5,"Cabal Method",null,null,5,"M"]
[6,"Magic Square Method",null,null,6,"M"]
[7,"Thaumaturgy Method",null,null,7,"M"]
[8,"Ritual Method",null,null,8,"M"]
{"$rows_left_out":453}
{"sheet":"Initial Skills","index":5,"n_rows":25,"n_cols":44,"rows_kept":25}
[null,"Skill Cluster Inclusion Table"]
[1,"Warrior","Light Axes",1,"Hand-to-hand",1,"Cudgels",1,"Spears",1,"Thrown Weapons",1,"Shields",1,"Dodge",1,"Berserker Rage",1,"Grapple",1,"Tackle",1,"Immobile Opponent Removal",1,"Hide in Shadows",1,"Move Silently",1,"Acrobatics",1,"Ward Self",1,"Ritual Method",1,"Chirurgery",1,"Forestry",1," ",0," ",0,null," "]
[2,"Man-at-Arms","Polearms",2,"Single Edge Blades",1,"Short Blades",2,"Hammers",2,"Self Bows",2,"Dodge",1,"Immobile Opponent Removal",1,"Grapple",1,"Tackle",1,"Acrobatics",1,"Move Silently",1,"Chirurgery",1,"Military Engineer",1," ",0," ",0," ",0," ",0," ",0," ",0," ",0,null," "]
[3,"Chivalry","Polearms",2,"Two Edge Blades",1,"Single Edge Blades",1,"Shields",2,"Crossbows",1,"Dodge",1,"Grapple",1,"Tackle",1,"Protection from Evil (M)",1,"Protection from Magic (M)",1,"Ritual Method",1,"Chirurgery",1,"Military Engineer",1,"Service",1,"Armory",1,"Riding",1," ",0," ",0," ",0," ",0,null," "]
[4,"Knight","Two Edge Blades",2,"Mounted Lance",1,"Single Edge Blades",1,"Shields",2,"Dodge",1,"Tackle",1,"Grapple",1,"Protection from Evil (M)",1,"Protection from Magic (M)",1,"Ritual Method",1,"Chirurgery",1,"Military Engineer",1,"Service",1,"Armory",1,"Riding",1,"Finance",1,"Falconry",1," ",0," ",0," ",0,null," "]
[5,"Cutpurse","Knives",1,"Hand-to-Hand",1,"Dodge",1,"Tackle",1,"Charm Person",1,"Charm Small Animal",1,"Essence Method",1,"Acrobatics",1,"Detect Noises",2,"Hide in Shadows",2,"Move Silently",1,"Pick Pocket",2,"Animal Training",1,"Dancing",1,"Bargain",1," ",0," ",0," ",0," ",0," ",0,null," "]
[6,"Thief","Knives",1,"Thrown Weapons",1,"Hand-to-Hand",1,"Grapple",1,"Dodge",1,"Gemology",1,"Chirurgery",1,"Acrobatics",1,"Detect Noises",1,"Hide in Shadows",2,"Move Silently",2,"Disarm Trap",2,"Pick Lock",2,"Backstab",1," ",0," ",0," ",0," ",0," ",0," ",0,null," "]
[7,"Assassin","Knives",2,"Eastern Hand Darts",1,"Short Blades",1,"Single Edge Blades",1,"Dodge",1,"Immobile Opponent Removal",1,"Chemistry",1,"Chirurgery",1,"Acrobatics",1,"Detect Noises",1,"Hide in Shadows",1,"Move Silently",1,"Administration of Poison",1,"Backstab",1,"Physical Torture",1,"Disarm Trap",1,"Pick Lock",1," ",0," ",0," ",0,null," "]
[8,"Primative Talent","Knives",1,"Dodge",1,"any craft skill",2,"Hide in Shadows",1,"Hold Small Animal",1,"Circle of Protection",1,"Detect Tracks",1,"Detect Direction",1,"Detect Etheric",1,"Charm Person",1,"any spell",1,"any spell",1,"any spell",1,"any spell",1,"any spell",1,"Ward Self",1,"Essence Method",1," ",0," ",0," ",0,null," "]
[9,"Hex Master","Knives",1,"Staves",1,"Dodge",1,"Mathematics",2,"Ink & Paper Making",2,"Finance",1,"coercive spell",1,"coercive spell",1,"coercive spell",1,"traumatic spell",1,"traumatic spell",1,"Circle of Protection",1,"Magic Square Method",1,"Ritual Method",1,"augury spell",1," ",0," ",0," ",0," ",0," ",0,null," "]
{"$rows_left_out":16}
{"sheet":"Tables","index":6,"n_rows":351,"n_cols":25,"rows_kept":351}
["Race Selection Table"]
["roll","race","IQ","WIS","CON","STR","DEX","SP","AP","ART","ETH","FAI","MAG","BOD","AGE","LE",null,"VISION"]
[2,"Pixie",null,null,-1,-1,3,-1,2,1,3,null,3,-3,30,0,1,"Normal"]
[3,"Saurig",1,null,1,null,2,-2,-1,{"$nulls":3},-1,null,10,150,2,"Normal"]
[4,"Hobbit",null,null,3,null,3,{"$nulls":3},2,null,-4,-2,30,150,3,"Night Vision"]
[5,"Dwarf",null,null,3,2,-2,-1,-2,1,-1,-2,null,2,50,300,4,"Night Vision"]
[6,"Half-Elf",null,null,2,null,1,null,1,{"$nulls":3},1,null,40,1000,5,"Normal"]
[7,"Human",{"$nulls":12},14,80,6,"Normal"]
[17,"Elf",null,null,-2,-1,3,1,1,1,1,2,2,-1,100,0,7,"Infra-Vision"]
[18,"Gnome",null,null,3,2,-2,null,-2,2,-1,{"$nulls":3},55,330,8,"Normal"]
{"$rows_left_out":342}
{"sheet":"Choosers","index":7,"n_rows":65,"n_cols":8,"rows_kept":65}
[]
["Axes","Axes","Battle Axe",null,null,"Crossbows","Crossbows","Light Crossbow"]
["Cudgels","Axes","Norman War Axe",null,null,"Eastern Hand Darts","Crossbows","Thieves Crossbow"]
["Flails","Axes","Woodsman's Axe",null,null,"Self Bows","Crossbows","Heavy Crossbow"]
["Foil","Axes","Halberd",null,null,"Thrown Weapons","Eastern Hand Darts","Small Blowgun"]
["Hammers","Axes","Two-Handed Battle Axe",null,null,"All Missile Weapons","Eastern Hand Darts","Large Blowgun"]
["Knives","Cudgels","Light Club",{"$nulls":3},"Eastern Hand Darts","Chakra"]
["Light Axes","Cudgels","Cudgel",{"$nulls":3},"Self Bows","Shortbow"]
["Lance","Cudgels","War Pick",{"$nulls":3},"Self Bows","Longbow"]
["Polearms","Cudgels","Heavy Club",{"$nulls":3},"Self Bows","Composite bow"]
{"$rows_left_out":56}
{"sheet":"Crunch","index":8,"n_rows":39,"n_cols":16,"rows_kept":39}
[{"$f":"B1&C1&D1&E1&F1&G1&H1","v":"|Intelligence |={border:1px dashed blue}.5||Charisma |={border:1px dashed green}.10||Stealth |={border:1px solid black}.16|"},"|Intelligence |={border:1px dashed blue}.",{"$f":"Frontsheet!E3","v":5},"||Charisma |={border:1px dashed green}.",{"$f":"Frontsheet!E14","v":10},"||Stealth |={border:1px solid black}.",{"$f":"Frontsheet!E9","v":16},"|"]
["|Wisdom |={border:1px dashed blue}.15||Charm |={border:1px dashed green}.11||Combat |={border:1px solid black}.16|","|Wisdom |={border:1px dashed blue}.",{"$f":"Frontsheet!E4","v":15},"||Charm |={border:1px dashed green}.",{"$f":"Frontsheet!E15","v":11},"||Combat |={border:1px solid black}.",{"$f":"Frontsheet!E10","v":16},"|"]
["|Constitution |={border:1px dashed blue}.5||Stamina |={border:1px solid black}.4||Magic |={border:1px solid black}.10|","|Constitution |={border:1px dashed blue}.",{"$f":"Frontsheet!E5","v":5},"||Stamina |={border:1px solid black}.",{"$f":"Frontsheet!E16","v":4},"||Magic |={border:1px solid black}.",{"$f":"Frontsheet!E11","v":10},"|"]
["|Strength |={border:1px dashed blue}.16||Vigor |={border:1px solid black}.4||Miracle |={border:1px solid black}.14|","|Strength |={border:1px dashed blue}.",{"$f":"Frontsheet!E6","v":16},"||Vigor |={border:1px solid black}.",{"$f":"Frontsheet!E18","v":4},"||Miracle |={border:1px solid black}.",{"$f":"Frontsheet!E12","v":14},"|"]
["|Dexterity |={border:1px dashed blue}.22||Body |={border:1px solid black}.11||Armor Class |={border:1px dashed blue}.6(0)|","|Dexterity |={border:1px dashed blue}.",{"$f":"Frontsheet!E7","v":22},"||Body |={border:1px solid black}.",{"$f":"Frontsheet!E17","v":11},"||Armor Class |={border:1px dashed blue}.",{"$f":"CONCATENATE(-VALUE(Frontsheet!E31),IF(Frontsheet!E32>0,Frontsheet!E32,\"\"))","v":"6(0)"},"|"]
["|_\\2.*Human*||_\\2.*Male*||Speech |=.12|","|_\\2.*",{"$f":"Frontsheet!Q4","v":"Human"},"*||_\\2.*",{"$f":"Frontsheet!Q3","v":"Male"},"*||Speech |=.",{"$f":"Frontsheet!K3","v":12},"|"]
["|\\2.5 ft 8 in tall||\\2.190 lbs||Appearance |=.11|",{"$f":"\"|\\2.\"&Frontsheet!J9&\" ft \"&Frontsheet!K9&\" in tall\"","v":"|\\2.5 ft 8 in tall"},null,{"$f":"\"||\\2.\"&Frontsheet!J10&\" lbs\"","v":"||\\2.190 lbs"},null,"||Appearance |=.",{"$f":"Frontsheet!K4","v":11},"|"]
["|\\2.29 years of age||\\2.able to carry 314 lbs||Art |=.6|",{"$f":"\"|\\2.\"&Frontsheet!J12&\" years of age\"","v":"|\\2.29 years of age"},null,{"$f":"\"||\\2.able to carry \"&Frontsheet!J11&\" lbs\"","v":"||\\2.able to carry 314 lbs"},null,"||Art |=.",{"$f":"Frontsheet!K5","v":6},"|"]
["|\\5.A Townsman born in the sign of Pisces||Ethics |=.2|","|\\5.A ",{"$f":"Frontsheet!Q7","v":"Townsman"}," born in the sign of ",{"$f":"Frontsheet!Q6","v":"Pisces"},"||Ethics |=.",{"$f":"Frontsheet!K6","v":2},"|"]
["|\\5.Generally trained as a *Knight*||Faith |=.8|",{"$f":"\"|\\5.Generally trained as a *\"&Frontsheet!E20&\"*\"","v":"|\\5.Generally trained as a *Knight*"},{"$nulls":3},"||Faith |=.",{"$f":"Frontsheet!K7","v":8},"|"]
{"$rows_left_out":30}
{"sheet":"Revisions","index":9,"n_rows":14,"n_cols":4,"rows_kept":14}
["Credits:","Benjamin Holty; Design, Data Entry, Programming 1986-1995, 2005-2014"]
[null,"Bruce Dain; Programming 1995-2005"]
[null,"Special thanks to Bruce for all his hard work on this project. His programming expertise was instrumental in bringing many of the more powerful data processes to life. (Even though he occassionally had ulterior motives in changing the root formulas of the system.)"]
[]
["REVISIONS: "]
[]
[4.1,"Some general corrections to formulas, DEL Bruce frontsheet","2012-08-10","BWH"]
[null,"Char Equip: ADD chooser menus for armor and weapons "]
[null,"Char Stats: ADD chooser menu for Skill Cluster"]
[]
{"$rows_left_out":4}