{"text_format":"3","workbook":"xlsx","n_sheets":10,"sheets":["Frontsheet","Character Equipment","Character Stats","Equipment List","Skill List","Initial Skills","Tables","Choosers","Crunch","Revisions"],"not_rendered":{"macros":1,"defined_names":216},"read":"whole","date_system":"1900"}

{"sheet":"Frontsheet","index":0,"n_rows":70,"n_cols":56,"rows_kept":70,"merged":[[0,22,0,24],[9,9,9,10],[10,9,10,10],[11,9,11,10],[19,16,19,17],[20,16,20,17],[23,1,23,2],[23,4,23,5],[23,7,23,8],[23,10,23,11],[23,13,23,14],[23,16,23,17],[24,1,24,2],[24,4,24,5],[24,7,24,8],[24,10,24,11],[24,13,24,14],[24,16,24,17],[25,0,26,0],[27,0,28,0],[33,5,33,6],[66,0,68,0]]}
["Character:",null,null,{"$f":"character_name","v":"TBA"},{"$nulls":8},"Player: ",null,{"$f":"player_name","v":"4.2 Beta"},{"$nulls":4},"Date Gen'd",null,null,{"$f":"'Character Stats'!L2","v":"2015-08-19T15:38:35.760"}]
[]
["Intelligence",{"$nulls":3},{"$f":"intelligence","v":5},null,"Speech",{"$nulls":3},{"$f":"speech","v":12},null,"Gender",{"$nulls":3},{"$f":"sex_disp","v":"Male"},null,null,"Skills"]
["Wisdom",{"$nulls":3},{"$f":"wisdom","v":15},null,"Appearance",{"$nulls":3},{"$f":"appearance","v":11},null,"Race",{"$nulls":3},{"$f":"race_disp","v":"Human"},null,null,{"$f":"IF(AI23>0,INDIRECT(CONCATENATE(\"'Character Stats'!a\",AJ23)),\"\")","v":"Two Edge Blades"},{"$nulls":4},{"$f":"IF(AI23>0,INDIRECT(CONCATENATE(\"'Character Stats'!f\",AJ23)),\"\")","v":2}]
["Constitution",{"$nulls":3},{"$f":"constitution","v":5},null,"Art",{"$nulls":3},{"$f":"art","v":6},null,"Size",{"$nulls":3},{"$f":"size1","v":10},{"$f":"size2","v":13},null,"Mounted Lance",{"$nulls":4},1]
["Strength",{"$nulls":3},{"$f":"strength","v":16},null,"Ethics",{"$nulls":3},{"$f":"ethics","v":2},null,"Horoscope",{"$nulls":3},{"$f":"horoscope_disp","v":"Pisces"},null,null,"Single Edge Blades",{"$nulls":4},1]
["Dexterity",{"$nulls":3},{"$f":"dexterity","v":22},null,"Faith",{"$nulls":3},{"$f":"faith","v":8},null,"Social Status",{"$nulls":3},{"$f":"VLOOKUP(social_status,Tables!A317:B325,2)","v":"Townsman"},null,null,"Shields",{"$nulls":4},2]
[{"$nulls":19},"Dodge",{"$nulls":4},1]
["Stealth",{"$nulls":3},{"$f":"stealth","v":16},null,"Height",null,null,{"$f":"height_ft","v":{"v":5,"d":"5 ft"}},{"$f":"height_in","v":8},null,"Complexion",{"$nulls":3},{"$f":"IF('Character Stats'!L36=\"\",\"\",'Character Stats'!L36)","v":""},null,null,"Tackle",{"$nulls":4},1]
["Combat",{"$nulls":3},{"$f":"combat","v":16},null,"Weight",null,null,{"$f":"weight","v":190},null,"lb","Eye Color",{"$nulls":3},{"$f":"IF('Character Stats'!L37=\"\",\"\",'Character Stats'!L37)","v":""},null,null,{"$f":"IF(AI29>0,INDIRECT(CONCATENATE(\"'Character Stats'!a\",AJ29)),\"\")","v":"Grapple"},{"$nulls":4},{"$f":"IF(AI29>0,INDIRECT(CONCATENATE(\"'Character Stats'!f\",AJ29)),\"\")","v":1}]
["Magic",{"$nulls":3},{"$f":"magic","v":10},null,"Carry Cap",null,null,{"$f":"carryingcap","v":314},null,"lb","Hair Color",{"$nulls":3},{"$f":"IF('Character Stats'!L38=\"\",\"\",'Character Stats'!L38)","v":""},null,null,{"$f":"IF(AI30>0,INDIRECT(CONCATENATE(\"'Character Stats'!a\",AJ30)),\"\")","v":"Chirurgery"},{"$nulls":4},{"$f":"IF(AI30>0,INDIRECT(CONCATENATE(\"'Character Stats'!f\",AJ30)),\"\")","v":1}]
["Miracle",{"$nulls":3},{"$f":"miracle","v":14},null,"Age",null,null,{"$f":"age_stat","v":29},null,"yr","Handedness",{"$nulls":3},{"$f":"IF('Character Stats'!L35=\"\",\"\",'Character Stats'!L35)","v":""},null,null,{"$f":"IF(AI31>0,INDIRECT(CONCATENATE(\"'Character Stats'!a\",AJ31)),\"\")","v":"Military Engineer"},{"$nulls":4},{"$f":"IF(AI31>0,INDIRECT(CONCATENATE(\"'Character Stats'!f\",AJ31)),\"\")","v":1}]
[{"$nulls":19},{"$f":"IF(AI32>0,INDIRECT(CONCATENATE(\"'Character Stats'!a\",AJ32)),\"\")","v":"Service"},{"$nulls":4},{"$f":"IF(AI32>0,INDIRECT(CONCATENATE(\"'Character Stats'!f\",AJ32)),\"\")","v":1}]
["Charisma",{"$nulls":3},{"$f":"charisma","v":10},null,"Religion",null,null,{"$f":"IF('Character Stats'!L31=\"\",\"\",'Character Stats'!L31)","v":""},null,null,"Identifying Marks",{"$nulls":6},{"$f":"IF(AI33>0,INDIRECT(CONCATENATE(\"'Character Stats'!a\",AJ33)),\"\")","v":"Armory"},{"$nulls":4},{"$f":"IF(AI33>0,INDIRECT(CONCATENATE(\"'Character Stats'!f\",AJ33)),\"\")","v":1}]
["Charm",{"$nulls":3},{"$f":"charm","v":11},null,"Hometown",null,null,{"$f":"IF('Character Stats'!L30=\"\",\"\",'Character Stats'!L30)","v":""},{"$nulls":3},{"$f":"IF('Character Stats'!K40=\"\",\"\",'Character Stats'!K40)","v":""},{"$nulls":5},{"$f":"IF(AO23>0,INDIRECT(CONCATENATE(\"'Character Stats'!a\",AP23)),\"\")","v":"Riding"},{"$nulls":4},{"$f":"IF(AO23>0,INDIRECT(CONCATENATE(\"'Character Stats'!f\",AP23)),\"\")","v":1}]
["Stamina",{"$nulls":3},{"$f":"stamina","v":4},null,"Affiliations",null,null,{"$f":"IF('Character Stats'!L32=\"\",\"\",'Character Stats'!L32)","v":""},{"$nulls":3},{"$f":"IF('Character Stats'!K41=\"\",\"\",'Character Stats'!K41)","v":""},{"$nulls":5},{"$f":"IF(AO24>0,INDIRECT(CONCATENATE(\"'Character Stats'!a\",AP24)),\"\")","v":"Finance"},{"$nulls":4},{"$f":"IF(AO24>0,INDIRECT(CONCATENATE(\"'Character Stats'!f\",AP24)),\"\")","v":1}]
["Body",{"$nulls":3},{"$f":"body","v":11},null,"Guild Memberships",{"$nulls":5},"Vision",{"$nulls":4},{"$f":"IF('Character Stats'!L34=\"\",\"\",'Character Stats'!L34)","v":"Normal"},null,"Methods"]
["Vigor",{"$nulls":3},{"$f":"vigor","v":4},null,null,{"$f":"IF('Character Stats'!L33=\"\",\"\",'Character Stats'!L33)","v":""},{"$nulls":5},{"$f":"IF('Character Stats'!K42=\"\",\"\",'Character Stats'!K42)","v":""},{"$nulls":5},{"$f":"IF(AU23>0,INDIRECT(CONCATENATE(\"'Character Stats'!a\",AV23)),\"\")","v":"Ritual Method"},{"$nulls":5},{"$f":"IF(AU23>0,INDIRECT(CONCATENATE(\"'Character Stats'!f\",AV23)),\"\")","v":1}]
[{"$nulls":19},{"$f":"IF(AU24>0,INDIRECT(CONCATENATE(\"'Character Stats'!a\",AV24)),\"\")","v":""},{"$nulls":5},{"$f":"IF(AU24>0,INDIRECT(CONCATENATE(\"'Character Stats'!f\",AV24)),\"\")","v":""}]
["Skill Cluster",{"$nulls":3},{"$f":"skill_disp","v":"Knight"},{"$nulls":5},"Unused Experience",{"$nulls":5},{"$f":"exp_unused","v":675},null,null,{"$f":"IF(AU25>0,INDIRECT(CONCATENATE(\"'Character Stats'!a\",AV25)),\"\")","v":""},{"$nulls":5},{"$f":"IF(AU25>0,INDIRECT(CONCATENATE(\"'Character Stats'!f\",AV25)),\"\")","v":""}]
[{"$nulls":10},"Money",{"$nulls":5},{"$f":"money","v":660},null,null,{"$f":"IF(AU26>0,INDIRECT(CONCATENATE(\"'Character Stats'!a\",AV26)),\"\")","v":""},{"$nulls":5},{"$f":"IF(AU26>0,INDIRECT(CONCATENATE(\"'Character Stats'!f\",AV26)),\"\")","v":""}]
[{"$nulls":19},{"$f":"IF(AU27>0,INDIRECT(CONCATENATE(\"'Character Stats'!a\",AV27)),\"\")","v":""},{"$nulls":5},{"$f":"IF(AU27>0,INDIRECT(CONCATENATE(\"'Character Stats'!f\",AV27)),\"\")","v":""},{"$nulls":8},"Skills",{"$nulls":5},"Skills",{"$nulls":5},"Methods",{"$nulls":6},"Spells"]
["Injury Distribution",{"$nulls":16},"Attack Roll: Roll to Hit (Bash ends in 0 or 5), Roll Location (Critical ends in 0 or 5), Roll Damage",null,"Spells/Miracles",{"$nulls":5},"Skl|Dff|Sav|Sta",{"$nulls":8},{"$f":"IF(ISERROR(MATCH(\"S\",'Character Stats'!B24:B53,0)),0,MATCH(\"S\",'Character Stats'!B24:B53,0))","v":1},{"$f":"IF(AI23=0,0,23+AI23)","v":24},{"$f":"IF(AI23>0,53-AJ23,0)","v":29},{"$nulls":3},{"$f":"IF(AI33=0,0,IF(ISERROR(MATCH(\"S\",OFFSET('Character Stats'!B24,SUM(AI23:AI33),0,AK33,1),0)),0,MATCH(\"S\",OFFSET('Character Stats'!B24,SUM(AI23:AI33),0,AK33,1),0)))","v":1},{"$f":"IF(AI32=0,\"\",AO23+AJ33)","v":38},{"$f":"IF(AO23>0,53-AP23,0)","v":15},{"$nulls":3},{"$f":"IF(ISERROR(MATCH(\"M\",'Character Stats'!B24:B53,0)),0,MATCH(\"M\",'Character Stats'!B24:B53,0))","v":10},{"$f":"IF(AU23=0,\"\",23+AU23)","v":33},{"$f":"IF(AU23>0,53-AV23,0)","v":20},{"$nulls":4},{"$f":"IF(AU33=0,0,IF(ISERROR(MATCH(\"C\",OFFSET('Character Stats'!B24,SUM(AU29:AU33),0,AW33,1),0)),0,MATCH(\"C\",OFFSET('Character Stats'!B24,SUM(AU29:AU33),0,AW33,1),0)))","v":0},{"$f":"IF(AU32=0,\"\",BB23+AV33)","v":""},{"$f":"IF(BB23>0,53-BC23,0)","v":0}]
[null,"Head",null,null,"Chest",null,null,"Rt Arm",null,null,"Lt Arm",null,null,"Rt Leg",null,null,"Lt Leg",null,null,{"$f":"IF(AU29>0,INDIRECT(CONCATENATE(\"'Character Stats'!a\",AV29)),\"\")","v":"Protection from Evil (M)"},{"$nulls":5},{"$f":"IF(AU29>0,CONCATENATE(INDIRECT(CONCATENATE(\"'Character Stats'!f\",AV29)),\"|\",VLOOKUP(INDIRECT(CONCATENATE(\"'Character Stats'!d\",AV29)),Spell_Skills_by_number,15),\"|\",VLOOKUP(INDIRECT(CONCATENATE(\"'Character Stats'!d\",AV29)),Spell_Skills_by_number,17),\"|\",VLOOKUP(INDIRECT(CONCATENATE(\"'Character Stats'!d\",AV29)),Spell_Skills_by_number,16)),\"\")","v":"1|d3|-|2"},{"$nulls":8},{"$f":"IF(AI23=0,0,IF(ISERROR(MATCH(\"S\",OFFSET('Character Stats'!B24,AI23,0,AK23,1),0)),0,MATCH(\"S\",OFFSET('Character Stats'!B24,AI23,0,AK23,1),0)))","v":1},{"$f":"IF(AI24=0,\"\",AJ23+AI24)","v":25},28,{"$nulls":3},{"$f":"IF(AO23=0,0,IF(ISERROR(MATCH(\"S\",OFFSET('Character Stats'!B24,SUM(AI23:AI33)+AO23,0,AQ23,1),0)),0,MATCH(\"S\",OFFSET('Character Stats'!B24,SUM(AI23:AI33)+AO23,0,AQ23,1),0)))","v":1},{"$f":"IF(AO24=0,\"\",AP23+AO24)","v":39},14,{"$nulls":3},{"$f":"IF(AU23=0,0,IF(ISERROR(MATCH(\"M\",OFFSET('Character Stats'!B24,AU23,0,AW23,1),0)),0,MATCH(\"M\",OFFSET('Character Stats'!B24,AU23,0,AW23,1),0)))","v":0},{"$f":"IF(AU24=0,\"\",AV23+AU24)","v":""},{"$f":"IF(AU24>0,53-AV24,0)","v":0},{"$nulls":4},{"$f":"IF(BB23=0,0,IF(ISERROR(MATCH(\"C\",OFFSET('Character Stats'!B24,SUM(AU29:AU33)+BB23,0,BD23,1),0)),0,MATCH(\"C\",OFFSET('Character Stats'!B24,SUM(AU29:AU33)+BB23,0,BD23,1),0)))","v":0},{"$f":"IF(BB24=0,\"\",BC23+BB24)","v":""},0]
["Location","01-15",null,null,"16-60",null,null,"61+(1-2)",null,null,"61+(3-4)",null,null,"61+(5)",null,null,"61+(6)",null,null,{"$f":"IF(AU30>0,INDIRECT(CONCATENATE(\"'Character Stats'!a\",AV30)),\"\")","v":"Protection from Magic (M)"},{"$nulls":5},{"$f":"IF(AU30>0,CONCATENATE(INDIRECT(CONCATENATE(\"'Character Stats'!f\",AV30)),\"|\",VLOOKUP(INDIRECT(CONCATENATE(\"'Character Stats'!d\",AV30)),Spell_Skills_by_number,15),\"|\",VLOOKUP(INDIRECT(CONCATENATE(\"'Character Stats'!d\",AV30)),Spell_Skills_by_number,17),\"|\",VLOOKUP(INDIRECT(CONCATENATE(\"'Character Stats'!d\",AV30)),Spell_Skills_by_number,16)),\"\")","v":"1|d4|-|4"},{"$nulls":8},{"$f":"IF(AI24=0,0,IF(ISERROR(MATCH(\"S\",OFFSET('Character Stats'!B24,SUM(AI23:AI24),0,AK24,1),0)),0,MATCH(\"S\",OFFSET('Character Stats'!B24,SUM(AI23:AI24),0,AK24,1),0)))","v":1},26,27,{"$nulls":3},{"$f":"IF(AO24=0,0,IF(ISERROR(MATCH(\"S\",OFFSET('Character Stats'!B24,SUM(AI23:AI33)+SUM(AO23:AO24),0,AQ24,1),0)),0,MATCH(\"S\",OFFSET('Character Stats'!B24,SUM(AI23:AI33)+SUM(AO23:AO24),0,AQ24,1),0)))","v":1},40,13,{"$nulls":3},{"$f":"IF(AU24=0,0,IF(ISERROR(MATCH(\"M\",OFFSET('Character Stats'!B24,SUM(AU23:AU24),0,AW24,1),0)),0,MATCH(\"M\",OFFSET('Character Stats'!B24,SUM(AU23:AU24),0,AW24,1),0)))","v":0},{"$f":"IF(AU25=0,\"\",AV24+AU25)","v":""},{"$f":"IF(AU25>0,53-AV25,0)","v":0},{"$nulls":4},{"$f":"IF(BB24=0,0,IF(ISERROR(MATCH(\"C\",OFFSET('Character Stats'!B24,SUM(AU29:AU33)+SUM(BB23:BB24),0,BD24,1),0)),0,MATCH(\"C\",OFFSET('Character Stats'!B24,SUM(AU29:AU33)+SUM(BB23:BB24),0,BD24,1),0)))","v":0},{"$f":"IF(BB25=0,\"\",BC24+BB25)","v":""},0]
["Damage",{"$nulls":18},{"$f":"IF(AU31>0,INDIRECT(CONCATENATE(\"'Character Stats'!a\",AV31)),\"\")","v":""},{"$nulls":5},{"$f":"IF(AU31>0,CONCATENATE(INDIRECT(CONCATENATE(\"'Character Stats'!f\",AV31)),\"|\",VLOOKUP(INDIRECT(CONCATENATE(\"'Character Stats'!d\",AV31)),Spell_Skills_by_number,15),\"|\",VLOOKUP(INDIRECT(CONCATENATE(\"'Character Stats'!d\",AV31)),Spell_Skills_by_number,17),\"|\",VLOOKUP(INDIRECT(CONCATENATE(\"'Character Stats'!d\",AV31)),Spell_Skills_by_number,16)),\"\")","v":""},{"$nulls":8},{"$f":"IF(AI25=0,0,IF(ISERROR(MATCH(\"S\",OFFSET('Character Stats'!B24,SUM(AI23:AI25),0,AK25,1),0)),0,MATCH(\"S\",OFFSET('Character Stats'!B24,SUM(AI23:AI25),0,AK25,1),0)))","v":1},27,26,{"$nulls":3},{"$f":"IF(AO25=0,0,IF(ISERROR(MATCH(\"S\",OFFSET('Character Stats'!B24,SUM(AI23:AI33)+SUM(AO23:AO25),0,AQ25,1),0)),0,MATCH(\"S\",OFFSET('Character Stats'!B24,SUM(AI23:AI33)+SUM(AO23:AO25),0,AQ25,1),0)))","v":0},"",0,{"$nulls":3},{"$f":"IF(AU25=0,0,IF(ISERROR(MATCH(\"M\",OFFSET('Character Stats'!B24,SUM(AU23:AU25),0,AW25,1),0)),0,MATCH(\"M\",OFFSET('Character Stats'!B24,SUM(AU23:AU25),0,AW25,1),0)))","v":0},{"$f":"IF(AU26=0,\"\",AV25+AU26)","v":""},{"$f":"IF(AU26>0,53-AV26,0)","v":0},{"$nulls":4},{"$f":"IF(BB25=0,0,IF(ISERROR(MATCH(\"C\",OFFSET('Character Stats'!B24,SUM(AU29:AU33)+SUM(BB23:BB25),0,BD25,1),0)),0,MATCH(\"C\",OFFSET('Character Stats'!B24,SUM(AU29:AU33)+SUM(BB23:BB25),0,BD25,1),0)))","v":0},{"$f":"IF(BB26=0,\"\",BC25+BB26)","v":""},0]
[{"$nulls":19},{"$f":"IF(AU32>0,INDIRECT(CONCATENATE(\"'Character Stats'!a\",AV32)),\"\")","v":""},{"$nulls":5},{"$f":"IF(AU32>0,CONCATENATE(INDIRECT(CONCATENATE(\"'Character Stats'!f\",AV32)),\"|\",VLOOKUP(INDIRECT(CONCATENATE(\"'Character Stats'!d\",AV32)),Spell_Skills_by_number,15),\"|\",VLOOKUP(INDIRECT(CONCATENATE(\"'Character Stats'!d\",AV32)),Spell_Skills_by_number,17),\"|\",VLOOKUP(INDIRECT(CONCATENATE(\"'Character Stats'!d\",AV32)),Spell_Skills_by_number,16)),\"\")","v":""},{"$nulls":8},{"$f":"IF(AI26=0,0,IF(ISERROR(MATCH(\"S\",OFFSET('Character Stats'!B24,SUM(AI23:AI26),0,AK26,1),0)),0,MATCH(\"S\",OFFSET('Character Stats'!B24,SUM(AI23:AI26),0,AK26,1),0)))","v":1},28,25,{"$nulls":3},{"$f":"IF(AO26=0,0,IF(ISERROR(MATCH(\"S\",OFFSET('Character Stats'!B24,SUM(AI23:AI33)+SUM(AO23:AO26),0,AQ26,1),0)),0,MATCH(\"S\",OFFSET('Character Stats'!B24,SUM(AI23:AI33)+SUM(AO23:AO26),0,AQ26,1),0)))","v":0},"",0,{"$nulls":3},{"$f":"IF(AU26=0,0,IF(ISERROR(MATCH(\"M\",OFFSET('Character Stats'!B24,SUM(AU23:AU26),0,AW26,1),0)),0,MATCH(\"M\",OFFSET('Character Stats'!B24,SUM(AU23:AU26),0,AW26,1),0)))","v":0},{"$f":"IF(AU27=0,\"\",AV26+AU27)","v":""},{"$f":"IF(AU27>0,53-AV27,0)","v":0},{"$nulls":4},{"$f":"IF(BB26=0,0,IF(ISERROR(MATCH(\"C\",OFFSET('Character Stats'!B24,SUM(AU29:AU33)+SUM(BB23:BB26),0,BD26,1),0)),0,MATCH(\"C\",OFFSET('Character Stats'!B24,SUM(AU29:AU33)+SUM(BB23:BB26),0,BD26,1),0)))","v":0},{"$f":"IF(BB27=0,\"\",BC26+BB27)","v":""},0]
["Critical",{"$nulls":18},{"$f":"IF(AU33>0,INDIRECT(CONCATENATE(\"'Character Stats'!a\",AV33)),\"\")","v":""},{"$nulls":5},{"$f":"IF(AU33>0,CONCATENATE(INDIRECT(CONCATENATE(\"'Character Stats'!f\",AV33)),\"|\",VLOOKUP(INDIRECT(CONCATENATE(\"'Character Stats'!d\",AV33)),Spell_Skills_by_number,15),\"|\",VLOOKUP(INDIRECT(CONCATENATE(\"'Character Stats'!d\",AV33)),Spell_Skills_by_number,17),\"|\",VLOOKUP(INDIRECT(CONCATENATE(\"'Character Stats'!d\",AV33)),Spell_Skills_by_number,16)),\"\")","v":""},{"$nulls":8},{"$f":"IF(AI27=0,0,IF(ISERROR(MATCH(\"S\",OFFSET('Character Stats'!B24,SUM(AI23:AI27),0,AK27,1),0)),0,MATCH(\"S\",OFFSET('Character Stats'!B24,SUM(AI23:AI27),0,AK27,1),0)))","v":1},29,24,{"$nulls":3},{"$f":"IF(AO27=0,0,IF(ISERROR(MATCH(\"S\",OFFSET('Character Stats'!B24,SUM(AI23:AI33)+SUM(AO23:AO27),0,AQ27,1),0)),0,MATCH(\"S\",OFFSET('Character Stats'!B24,SUM(AI23:AI33)+SUM(AO23:AO27),0,AQ27,1),0)))","v":0},"",0,{"$nulls":3},"Spells",{"$nulls":6},{"$f":"IF(BB27=0,0,IF(ISERROR(MATCH(\"C\",OFFSET('Character Stats'!B24,SUM(AU29:AU33)+SUM(BB23:BB27),0,BD27,1),0)),0,MATCH(\"C\",OFFSET('Character Stats'!B24,SUM(AU29:AU33)+SUM(BB23:BB27),0,BD27,1),0)))","v":0},{"$f":"IF(BB28=0,\"\",BC27+BB28)","v":""},0]
[{"$nulls":19},{"$f":"IF(BB23>0,INDIRECT(CONCATENATE(\"'Character Stats'!a\",BC23)),\"\")","v":""},{"$nulls":5},{"$f":"IF(BB23>0,CONCATENATE(INDIRECT(CONCATENATE(\"'Character Stats'!f\",BC23)),\"|\",VLOOKUP(INDIRECT(CONCATENATE(\"'Character Stats'!d\",BC23)),Spell_Skills_by_number,15),\"|\",VLOOKUP(INDIRECT(CONCATENATE(\"'Character Stats'!d\",BC23)),Spell_Skills_by_number,17),\"|\",VLOOKUP(INDIRECT(CONCATENATE(\"'Character Stats'!d\",BC23)),Spell_Skills_by_number,16)),\"\")","v":""},{"$nulls":8},{"$f":"IF(AI28=0,0,IF(ISERROR(MATCH(\"S\",OFFSET('Character Stats'!B24,SUM(AI23:AI28),0,AK28,1),0)),0,MATCH(\"S\",OFFSET('Character Stats'!B24,SUM(AI23:AI28),0,AK28,1),0)))","v":1},30,{"$f":"IF(AI29>0,53-AJ29,0)","v":23},{"$nulls":3},{"$f":"IF(AO28=0,0,IF(ISERROR(MATCH(\"S\",OFFSET('Character Stats'!B24,SUM(AI23:AI33)+SUM(AO23:AO28),0,AQ28,1),0)),0,MATCH(\"S\",OFFSET('Character Stats'!B24,SUM(AI23:AI33)+SUM(AO23:AO28),0,AQ28,1),0)))","v":0},"",{"$f":"IF(AO29>0,53-AP29,0)","v":0},{"$nulls":3},{"$f":"IF(ISERROR(MATCH(\"C\",'Character Stats'!B24:B53,0)),0,MATCH(\"C\",'Character Stats'!B24:B53,0))","v":8},{"$f":"IF(AU29=0,0,23+AU29)","v":31},{"$f":"IF(AU29>0,53-AV29,0)","v":22}]
["Body Armor",{"$nulls":3},"AC",{"$nulls":4},"Body Damage",{"$nulls":3},{"$f":"CONCATENATE(\"(\",body,\")\")","v":"(11)"},null,"Critical Injuries",{"$nulls":3},"",{"$nulls":5},"",{"$nulls":8},{"$f":"IF(AI29=0,0,IF(ISERROR(MATCH(\"S\",OFFSET('Character Stats'!B24,SUM(AI23:AI29),0,AK29,1),0)),0,MATCH(\"S\",OFFSET('Character Stats'!B24,SUM(AI23:AI29),0,AK29,1),0)))","v":4},34,{"$f":"IF(AI30>0,53-AJ30,0)","v":19},{"$nulls":3},{"$f":"IF(AO29=0,0,IF(ISERROR(MATCH(\"S\",OFFSET('Character Stats'!B24,SUM(AI23:AI33)+SUM(AO23:AO29),0,AQ29,1),0)),0,MATCH(\"S\",OFFSET('Character Stats'!B24,SUM(AI23:AI33)+SUM(AO23:AO29),0,AQ29,1),0)))","v":0},"",{"$f":"IF(AO30>0,53-AP30,0)","v":0},{"$nulls":3},{"$f":"IF(AU29=0,0,IF(ISERROR(MATCH(\"C\",OFFSET('Character Stats'!B24,AU29,0,AW29,1),0)),0,MATCH(\"C\",OFFSET('Character Stats'!B24,AU29,0,AW29,1),0)))","v":1},{"$f":"IF(AU30=0,\"\",AV29+AU30)","v":32},{"$f":"IF(AU30>0,53-AV30,0)","v":21}]
[{"$f":"'Character Equipment'!B8","v":"Cuirass"},{"$nulls":3},{"$f":"IF(A31>\" \",CONCATENATE(\"(\",VLOOKUP('Character Equipment'!A8,equipment_table,3),\")\"),\"\")","v":"(6)"},{"$nulls":14},"",{"$nulls":5},"",{"$nulls":8},{"$f":"IF(AI30=0,0,IF(ISERROR(MATCH(\"S\",OFFSET('Character Stats'!B24,SUM(AI23:AI30),0,AK30,1),0)),0,MATCH(\"S\",OFFSET('Character Stats'!B24,SUM(AI23:AI30),0,AK30,1),0)))","v":1},35,{"$f":"IF(AI31>0,53-AJ31,0)","v":18},{"$nulls":3},{"$f":"IF(AO30=0,0,IF(ISERROR(MATCH(\"S\",OFFSET('Character Stats'!B24,SUM(AI23:AI33)+SUM(AO23:AO30),0,AQ30,1),0)),0,MATCH(\"S\",OFFSET('Character Stats'!B24,SUM(AI23:AI33)+SUM(AO23:AO30),0,AQ30,1),0)))","v":0},"",{"$f":"IF(AO31>0,53-AP31,0)","v":0},{"$nulls":3},{"$f":"IF(AU30=0,0,IF(ISERROR(MATCH(\"C\",OFFSET('Character Stats'!B24,SUM(AU29:AU30),0,AW30,1),0)),0,MATCH(\"C\",OFFSET('Character Stats'!B24,SUM(AU29:AU30),0,AW30,1),0)))","v":0},{"$f":"IF(AU31=0,\"\",AV30+AU31)","v":""},{"$f":"IF(AU31>0,53-AV31,0)","v":0}]
[{"$f":"'Character Equipment'!B9","v":"None"},{"$nulls":3},{"$f":"IF(A32>\" \",CONCATENATE(\"(\",VLOOKUP('Character Equipment'!A9,equipment_table,3),\")\"),\"\")","v":"(0)"},{"$nulls":14},"",{"$nulls":5},"",{"$nulls":8},{"$f":"IF(AI31=0,0,IF(ISERROR(MATCH(\"S\",OFFSET('Character Stats'!B24,SUM(AI23:AI31),0,AK31,1),0)),0,MATCH(\"S\",OFFSET('Character Stats'!B24,SUM(AI23:AI31),0,AK31,1),0)))","v":1},36,{"$f":"IF(AI32>0,53-AJ32,0)","v":17},{"$nulls":3},{"$f":"IF(AO31=0,0,IF(ISERROR(MATCH(\"S\",OFFSET('Character Stats'!B24,SUM(AI23:AI33)+SUM(AO23:AO31),0,AQ31,1),0)),0,MATCH(\"S\",OFFSET('Character Stats'!B24,SUM(AI23:AI33)+SUM(AO23:AO31),0,AQ31,1),0)))","v":0},"",{"$f":"IF(AO32>0,53-AP32,0)","v":0},{"$nulls":3},{"$f":"IF(AU31=0,0,IF(ISERROR(MATCH(\"C\",OFFSET('Character Stats'!B24,SUM(AU29:AU31),0,AW31,1),0)),0,MATCH(\"C\",OFFSET('Character Stats'!B24,SUM(AU29:AU31),0,AW31,1),0)))","v":0},{"$f":"IF(AU32=0,\"\",AV31+AU32)","v":""},{"$f":"IF(AU32>0,53-AV32,0)","v":0}]
[{"$nulls":9}," (Head = x5, Limb = /5)",{"$nulls":9},"",{"$nulls":5},"",{"$nulls":8},{"$f":"IF(AI32=0,0,IF(ISERROR(MATCH(\"S\",OFFSET('Character Stats'!B24,SUM(AI23:AI32),0,AK32,1),0)),0,MATCH(\"S\",OFFSET('Character Stats'!B24,SUM(AI23:AI32),0,AK32,1),0)))","v":1},37,{"$f":"IF(AI33>0,53-AJ33,0)","v":16},{"$nulls":3},{"$f":"IF(AO32=0,0,IF(ISERROR(MATCH(\"S\",OFFSET('Character Stats'!B24,SUM(AI23:AI33)+SUM(AO23:AO32),0,AQ32,1),0)),0,MATCH(\"S\",OFFSET('Character Stats'!B24,SUM(AI23:AI33)+SUM(AO23:AO32),0,AQ32,1),0)))","v":0},"",{"$f":"IF(AO33>0,53-AP33,0)","v":0},{"$nulls":3},{"$f":"IF(AU32=0,0,IF(ISERROR(MATCH(\"C\",OFFSET('Character Stats'!B24,SUM(AU29:AU32),0,AW32,1),0)),0,MATCH(\"C\",OFFSET('Character Stats'!B24,SUM(AU29:AU32),0,AW32,1),0)))","v":0},{"$f":"IF(AU33=0,\"\",AV32+AU33)","v":""},{"$f":"IF(AU33>0,53-AV33,0)","v":0}]
["Head Protection",{"$nulls":3},"SC","Helm",{"$nulls":3},"Stamina",{"$nulls":3},{"$f":"CONCATENATE(\"(\",stamina,\")\")","v":"(4)"},{"$nulls":5},"",{"$nulls":5},""]
[{"$f":"'Character Equipment'!B12","v":"Norman Helm"},{"$nulls":3},{"$f":"IF(A35>\" \",CONCATENATE(\"(\",VLOOKUP('Character Equipment'!A12,equipment_table,3),\")\"),\"\")","v":"(4)"},{"$nulls":14},{"$f":"IF(BB45>0,INDIRECT(CONCATENATE(\"'Character Stats'!a\",BC45)),\"\")","v":""},{"$nulls":5},{"$f":"IF(BB45>0,CONCATENATE(INDIRECT(CONCATENATE(\"'Character Stats'!f\",BC45)),\"|\",VLOOKUP(INDIRECT(CONCATENATE(\"'Character Stats'!d\",BC45)),Spell_Skills_by_number,15),\"|\",VLOOKUP(INDIRECT(CONCATENATE(\"'Character Stats'!d\",BC45)),Spell_Skills_by_number,17),\"|\",VLOOKUP(INDIRECT(CONCATENATE(\"'Character Stats'!d\",BC45)),Spell_Skills_by_number,16)),\"\")","v":""}]
[{"$f":"'Character Equipment'!B13","v":"Leather Hood"},{"$nulls":3},{"$f":"IF(A36>\" \",CONCATENATE(\"(\",VLOOKUP('Character Equipment'!A13,equipment_table,3),\")\"),\"\")","v":"(1)"},{"$nulls":14},{"$f":"IF(BB30>0,INDIRECT(CONCATENATE(\"'Character Stats'!a\",BC30)),\"\")","v":""},{"$nulls":5},{"$f":"IF(BB30>0,CONCATENATE(INDIRECT(CONCATENATE(\"'Character Stats'!f\",BC30)),\"|\",VLOOKUP(INDIRECT(CONCATENATE(\"'Character Stats'!d\",BC30)),Spell_Skills_by_number,15),\"|\",VLOOKUP(INDIRECT(CONCATENATE(\"'Character Stats'!d\",BC30)),Spell_Skills_by_number,17),\"|\",VLOOKUP(INDIRECT(CONCATENATE(\"'Character Stats'!d\",BC30)),Spell_Skills_by_number,16)),\"\")","v":""}]
[]
["Melee Weapons",{"$nulls":3},"Mg","#B","Int",0,1,2,3,4,5,6,7,8,9,10,"Dam",null,"Vig","s VL","s L","s M","s H","s P","sk",null,"tr?","sk+com","com plus"]
[{"$f":"IF('Character Equipment'!K8=\"\",\"\",IF('Character Equipment'!K8>1,IF(AC39<1,\"\",CHAR(186))&'Character Equipment'!L8))","v":"Short Sword"},{"$nulls":3},{"$f":"IF(A39=\"\",\"\",'Character Equipment'!S8)","v":0},{"$f":"IF(A39=\"\",\"\",VLOOKUP('Character Equipment'!K8,weapons_table,6)+E39+IF(AC39>0,AE39,0))","v":3},{"$f":"IF(A39=\"\",\"\",VLOOKUP('Character Equipment'!K8,weapons_table,7)+dexterity+E39)","v":25},{"$f":"IF(A39=\"\",\"\",VLOOKUP('Character Equipment'!K8,weapons_table,8)+(E39*5)+IF(G67=\"\",0,G67)+IF(AC39>0,(combat+((AC39-1)*5)),0))","v":30},{"$f":"IF(A39=\"\",\"\",VLOOKUP('Character Equipment'!K8,weapons_table,9)+(E39*5)+IF(G67=\"\",0,G67)+IF(AC39>0,(combat+((AC39-1)*5)),0))","v":25},{"$f":"IF(A39=\"\",\"\",VLOOKUP('Character Equipment'!K8,weapons_table,10)+(E39*5)+IF(G67=\"\",0,G67)+IF(AC39>0,(combat+((AC39-1)*5)),0))","v":20},{"$f":"IF(A39=\"\",\"\",VLOOKUP('Character Equipment'!K8,weapons_table,11)+(E39*5)+IF(G67=\"\",0,G67)+IF(AC39>0,(combat+((AC39-1)*5)),0))","v":10},{"$f":"IF(A39=\"\",\"\",VLOOKUP('Character Equipment'!K8,weapons_table,12)+(E39*5)+IF(G67=\"\",0,G67)+IF(AC39>0,(combat+((AC39-1)*5)),0))","v":0},{"$f":"IF(A39=\"\",\"\",VLOOKUP('Character Equipment'!K8,weapons_table,13)+(E39*5)+IF(G67=\"\",0,G67)+IF(AC39>0,(combat+((AC39-1)*5)),0))","v":-5},{"$f":"IF(A39=\"\",\"\",VLOOKUP('Character Equipment'!K8,weapons_table,14)+(E39*5)+IF(G67=\"\",0,G67)+IF(AC39>0,(combat+((AC39-1)*5)),0))","v":-10},{"$f":"IF(A39=\"\",\"\",VLOOKUP('Character Equipment'!K8,weapons_table,15)+(E39*5)+IF(G67=\"\",0,G67)+IF(AC39>0,(combat+((AC39-1)*5)),0))","v":-15},{"$f":"IF(A39=\"\",\"\",VLOOKUP('Character Equipment'!K8,weapons_table,16)+(E39*5)+IF(G67=\"\",0,G67)+IF(AC39>0,(combat+((AC39-1)*5)),0))","v":-15},{"$f":"IF(A39=\"\",\"\",VLOOKUP('Character Equipment'!K8,weapons_table,17)+(E39*5)+IF(G67=\"\",0,G67)+IF(AC39>0,(combat+((AC39-1)*5)),0))","v":-20},{"$f":"IF(A39=\"\",\"\",VLOOKUP('Character Equipment'!K8,weapons_table,18)+(E39*5)+IF(G67=\"\",0,G67)+IF(AC39>0,(combat+((AC39-1)*5)),0))","v":-25},{"$f":"IF(A39=\"\",\"\",IF((E39+damage_bonus)>0,CONCATENATE(VLOOKUP('Character Equipment'!K8,weapons_table,19),\"+\",(E39+damage_bonus)),IF((E39+damage_bonus)<0,CONCATENATE(VLOOKUP('Character Equipment'!K8,weapons_table,19),(E39+damage_bonus)),VLOOKUP('Character Equipment'!K8,weapons_table,19))))","v":"2d6"},null,{"$f":"IF(A39=\"\",\"\",IF(VLOOKUP('Character Equipment'!K8,weapons_table,3)=\"H\",vigor+2,IF(VLOOKUP('Character Equipment'!K8,weapons_table,3)=\"M\",vigor+1,IF(VLOOKUP('Character Equipment'!K8,weapons_table,3)=\"VL\",vigor-2,vigor))))","v":2},{"$f":"IF(A39=\"\",\"\",VLOOKUP('Character Equipment'!K8,weapons_table,21))","v":0},{"$f":"IF(A39=\"\",\"\",VLOOKUP('Character Equipment'!K8,weapons_table,22))","v":0},{"$f":"IF(A39=\"\",\"\",VLOOKUP('Character Equipment'!K8,weapons_table,23))","v":0},{"$f":"IF(A39=\"\",\"\",VLOOKUP('Character Equipment'!K8,weapons_table,24))","v":0},{"$f":"IF(A39=\"\",\"\",VLOOKUP('Character Equipment'!K8,weapons_table,25))","v":0},{"$f":"IF(ISERROR(VLOOKUP('Character Equipment'!K8,weapons_table,26)),\"\",VLOOKUP('Character Equipment'!K8,weapons_table,26))","v":"Short Blades"},null,{"$f":"IF(ISERROR(VLOOKUP(VLOOKUP('Character Equipment'!K8,weapons_table,26),character_skill_table,6,FALSE)),0,VLOOKUP(VLOOKUP('Character Equipment'!K8,weapons_table,26),character_skill_table,6,FALSE))","v":0},{"$f":"IF(AC39>0,CONCATENATE(AA39,IF(combat<10,CONCATENATE(\"0\",combat),combat)),\"\")","v":""},{"$f":"IF(AC39>0,VLOOKUP(AD39,combat_plus_table,3),0)","v":0}]
[{"$f":"IF('Character Equipment'!K9=\"\",\"\",IF('Character Equipment'!K9>1,IF(AC40<1,\"\",CHAR(186))&'Character Equipment'!L9))","v":"Warhammer"},{"$nulls":3},{"$f":"IF(A40=\"\",\"\",'Character Equipment'!S9)","v":0},{"$f":"IF(A40=\"\",\"\",VLOOKUP('Character Equipment'!K9,weapons_table,6)+E40+IF(AC40>0,AE40,0))","v":3},{"$f":"IF(A40=\"\",\"\",VLOOKUP('Character Equipment'!K9,weapons_table,7)+dexterity+E40)","v":27},{"$f":"IF(A40=\"\",\"\",VLOOKUP('Character Equipment'!K9,weapons_table,8)+(E40*5)+IF(G67=\"\",0,G67)+IF(AC40>0,(combat+((AC40-1)*5)),0))","v":15},{"$f":"IF(A40=\"\",\"\",VLOOKUP('Character Equipment'!K9,weapons_table,9)+(E40*5)+IF(G67=\"\",0,G67)+IF(AC40>0,(combat+((AC40-1)*5)),0))","v":15},{"$f":"IF(A40=\"\",\"\",VLOOKUP('Character Equipment'!K9,weapons_table,10)+(E40*5)+IF(G67=\"\",0,G67)+IF(AC40>0,(combat+((AC40-1)*5)),0))","v":15},{"$f":"IF(A40=\"\",\"\",VLOOKUP('Character Equipment'!K9,weapons_table,11)+(E40*5)+IF(G67=\"\",0,G67)+IF(AC40>0,(combat+((AC40-1)*5)),0))","v":10},{"$f":"IF(A40=\"\",\"\",VLOOKUP('Character Equipment'!K9,weapons_table,12)+(E40*5)+IF(G67=\"\",0,G67)+IF(AC40>0,(combat+((AC40-1)*5)),0))","v":10},{"$f":"IF(A40=\"\",\"\",VLOOKUP('Character Equipment'!K9,weapons_table,13)+(E40*5)+IF(G67=\"\",0,G67)+IF(AC40>0,(combat+((AC40-1)*5)),0))","v":10},{"$f":"IF(A40=\"\",\"\",VLOOKUP('Character Equipment'!K9,weapons_table,14)+(E40*5)+IF(G67=\"\",0,G67)+IF(AC40>0,(combat+((AC40-1)*5)),0))","v":5},{"$f":"IF(A40=\"\",\"\",VLOOKUP('Character Equipment'!K9,weapons_table,15)+(E40*5)+IF(G67=\"\",0,G67)+IF(AC40>0,(combat+((AC40-1)*5)),0))","v":5},{"$f":"IF(A40=\"\",\"\",VLOOKUP('Character Equipment'!K9,weapons_table,16)+(E40*5)+IF(G67=\"\",0,G67)+IF(AC40>0,(combat+((AC40-1)*5)),0))","v":0},{"$f":"IF(A40=\"\",\"\",VLOOKUP('Character Equipment'!K9,weapons_table,17)+(E40*5)+IF(G67=\"\",0,G67)+IF(AC40>0,(combat+((AC40-1)*5)),0))","v":-5},{"$f":"IF(A40=\"\",\"\",VLOOKUP('Character Equipment'!K9,weapons_table,18)+(E40*5)+IF(G67=\"\",0,G67)+IF(AC40>0,(combat+((AC40-1)*5)),0))","v":-10},{"$f":"IF(A40=\"\",\"\",IF((E40+damage_bonus)>0,CONCATENATE(VLOOKUP('Character Equipment'!K9,weapons_table,19),\"+\",(E40+damage_bonus)),IF((E40+damage_bonus)<0,CONCATENATE(VLOOKUP('Character Equipment'!K9,weapons_table,19),(E40+damage_bonus)),VLOOKUP('Character Equipment'!K9,weapons_table,19))))","v":"2d6"},null,{"$f":"IF(A40=\"\",\"\",IF(VLOOKUP('Character Equipment'!K9,weapons_table,3)=\"H\",vigor+2,IF(VLOOKUP('Character Equipment'!K9,weapons_table,3)=\"M\",vigor+1,IF(VLOOKUP('Character Equipment'!K9,weapons_table,3)=\"VL\",vigor-2,vigor))))","v":5},{"$f":"IF(A40=\"\",\"\",VLOOKUP('Character Equipment'!K9,weapons_table,21))","v":0},{"$f":"IF(A40=\"\",\"\",VLOOKUP('Character Equipment'!K9,weapons_table,22))","v":0},{"$f":"IF(A40=\"\",\"\",VLOOKUP('Character Equipment'!K9,weapons_table,23))","v":0},{"$f":"IF(A40=\"\",\"\",VLOOKUP('Character Equipment'!K9,weapons_table,24))","v":0},{"$f":"IF(A40=\"\",\"\",VLOOKUP('Character Equipment'!K9,weapons_table,25))","v":0},{"$f":"IF(ISERROR(VLOOKUP('Character Equipment'!K9,weapons_table,26)),\"\",VLOOKUP('Character Equipment'!K9,weapons_table,26))","v":"Hammers"},null,{"$f":"IF(ISERROR(VLOOKUP(VLOOKUP('Character Equipment'!K9,weapons_table,26),character_skill_table,6,FALSE)),0,VLOOKUP(VLOOKUP('Character Equipment'!K9,weapons_table,26),character_skill_table,6,FALSE))","v":0},"",0]
[{"$f":"IF('Character Equipment'!K10=\"\",\"\",IF('Character Equipment'!K10>1,IF(AC41<1,\"\",CHAR(186))&'Character Equipment'!L10))","v":"Maul"},{"$nulls":3},{"$f":"IF(A41=\"\",\"\",'Character Equipment'!S10)","v":0},{"$f":"IF(A41=\"\",\"\",VLOOKUP('Character Equipment'!K10,weapons_table,6)+E41+IF(AC41>0,AE41,0))","v":2},{"$f":"IF(A41=\"\",\"\",VLOOKUP('Character Equipment'!K10,weapons_table,7)+dexterity+E41)","v":30},{"$f":"IF(A41=\"\",\"\",VLOOKUP('Character Equipment'!K10,weapons_table,8)+(E41*5)+IF(G67=\"\",0,G67)+IF(AC41>0,(combat+((AC41-1)*5)),0))","v":20},{"$f":"IF(A41=\"\",\"\",VLOOKUP('Character Equipment'!K10,weapons_table,9)+(E41*5)+IF(G67=\"\",0,G67)+IF(AC41>0,(combat+((AC41-1)*5)),0))","v":20},{"$f":"IF(A41=\"\",\"\",VLOOKUP('Character Equipment'!K10,weapons_table,10)+(E41*5)+IF(G67=\"\",0,G67)+IF(AC41>0,(combat+((AC41-1)*5)),0))","v":20},{"$f":"IF(A41=\"\",\"\",VLOOKUP('Character Equipment'!K10,weapons_table,11)+(E41*5)+IF(G67=\"\",0,G67)+IF(AC41>0,(combat+((AC41-1)*5)),0))","v":20},{"$f":"IF(A41=\"\",\"\",VLOOKUP('Character Equipment'!K10,weapons_table,12)+(E41*5)+IF(G67=\"\",0,G67)+IF(AC41>0,(combat+((AC41-1)*5)),0))","v":20},{"$f":"IF(A41=\"\",\"\",VLOOKUP('Character Equipment'!K10,weapons_table,13)+(E41*5)+IF(G67=\"\",0,G67)+IF(AC41>0,(combat+((AC41-1)*5)),0))","v":25},{"$f":"IF(A41=\"\",\"\",VLOOKUP('Character Equipment'!K10,weapons_table,14)+(E41*5)+IF(G67=\"\",0,G67)+IF(AC41>0,(combat+((AC41-1)*5)),0))","v":20},{"$f":"IF(A41=\"\",\"\",VLOOKUP('Character Equipment'!K10,weapons_table,15)+(E41*5)+IF(G67=\"\",0,G67)+IF(AC41>0,(combat+((AC41-1)*5)),0))","v":15},{"$f":"IF(A41=\"\",\"\",VLOOKUP('Character Equipment'!K10,weapons_table,16)+(E41*5)+IF(G67=\"\",0,G67)+IF(AC41>0,(combat+((AC41-1)*5)),0))","v":10},{"$f":"IF(A41=\"\",\"\",VLOOKUP('Character Equipment'!K10,weapons_table,17)+(E41*5)+IF(G67=\"\",0,G67)+IF(AC41>0,(combat+((AC41-1)*5)),0))","v":5},{"$f":"IF(A41=\"\",\"\",VLOOKUP('Character Equipment'!K10,weapons_table,18)+(E41*5)+IF(G67=\"\",0,G67)+IF(AC41>0,(combat+((AC41-1)*5)),0))","v":-10},{"$f":"IF(A41=\"\",\"\",IF((E41+damage_bonus)>0,CONCATENATE(VLOOKUP('Character Equipment'!K10,weapons_table,19),\"+\",(E41+damage_bonus)),IF((E41+damage_bonus)<0,CONCATENATE(VLOOKUP('Character Equipment'!K10,weapons_table,19),(E41+damage_bonus)),VLOOKUP('Character Equipment'!K10,weapons_table,19))))","v":"2d10"},null,{"$f":"IF(A41=\"\",\"\",IF(VLOOKUP('Character Equipment'!K10,weapons_table,3)=\"H\",vigor+2,IF(VLOOKUP('Character Equipment'!K10,weapons_table,3)=\"M\",vigor+1,IF(VLOOKUP('Character Equipment'!K10,weapons_table,3)=\"VL\",vigor-2,vigor))))","v":6},{"$f":"IF(A41=\"\",\"\",VLOOKUP('Character Equipment'!K10,weapons_table,21))","v":0},{"$f":"IF(A41=\"\",\"\",VLOOKUP('Character Equipment'!K10,weapons_table,22))","v":0},{"$f":"IF(A41=\"\",\"\",VLOOKUP('Character Equipment'!K10,weapons_table,23))","v":0},{"$f":"IF(A41=\"\",\"\",VLOOKUP('Character Equipment'!K10,weapons_table,24))","v":0},{"$f":"IF(A41=\"\",\"\",VLOOKUP('Character Equipment'!K10,weapons_table,25))","v":0},{"$f":"IF(ISERROR(VLOOKUP('Character Equipment'!K10,weapons_table,26)),\"\",VLOOKUP('Character Equipment'!K10,weapons_table,26))","v":"Hammers"},null,{"$f":"IF(ISERROR(VLOOKUP(VLOOKUP('Character Equipment'!K10,weapons_table,26),character_skill_table,6,FALSE)),0,VLOOKUP(VLOOKUP('Character Equipment'!K10,weapons_table,26),character_skill_table,6,FALSE))","v":0},"",0]
[{"$f":"IF('Character Equipment'!K11=\"\",\"\",IF('Character Equipment'!K11>1,IF(AC42<1,\"\",CHAR(186))&'Character Equipment'!L11))","v":"Two-Handed Warhammer"},{"$nulls":3},{"$f":"IF(A42=\"\",\"\",'Character Equipment'!S11)","v":0},{"$f":"IF(A42=\"\",\"\",VLOOKUP('Character Equipment'!K11,weapons_table,6)+E42+IF(AC42>0,AE42,0))","v":2},{"$f":"IF(A42=\"\",\"\",VLOOKUP('Character Equipment'!K11,weapons_table,7)+dexterity+E42)","v":28},{"$f":"IF(A42=\"\",\"\",VLOOKUP('Character Equipment'!K11,weapons_table,8)+(E42*5)+IF(G67=\"\",0,G67)+IF(AC42>0,(combat+((AC42-1)*5)),0))","v":30},{"$f":"IF(A42=\"\",\"\",VLOOKUP('Character Equipment'!K11,weapons_table,9)+(E42*5)+IF(G67=\"\",0,G67)+IF(AC42>0,(combat+((AC42-1)*5)),0))","v":20},{"$f":"IF(A42=\"\",\"\",VLOOKUP('Character Equipment'!K11,weapons_table,10)+(E42*5)+IF(G67=\"\",0,G67)+IF(AC42>0,(combat+((AC42-1)*5)),0))","v":20},{"$f":"IF(A42=\"\",\"\",VLOOKUP('Character Equipment'!K11,weapons_table,11)+(E42*5)+IF(G67=\"\",0,G67)+IF(AC42>0,(combat+((AC42-1)*5)),0))","v":20},{"$f":"IF(A42=\"\",\"\",VLOOKUP('Character Equipment'!K11,weapons_table,12)+(E42*5)+IF(G67=\"\",0,G67)+IF(AC42>0,(combat+((AC42-1)*5)),0))","v":20},{"$f":"IF(A42=\"\",\"\",VLOOKUP('Character Equipment'!K11,weapons_table,13)+(E42*5)+IF(G67=\"\",0,G67)+IF(AC42>0,(combat+((AC42-1)*5)),0))","v":20},{"$f":"IF(A42=\"\",\"\",VLOOKUP('Character Equipment'!K11,weapons_table,14)+(E42*5)+IF(G67=\"\",0,G67)+IF(AC42>0,(combat+((AC42-1)*5)),0))","v":20},{"$f":"IF(A42=\"\",\"\",VLOOKUP('Character Equipment'!K11,weapons_table,15)+(E42*5)+IF(G67=\"\",0,G67)+IF(AC42>0,(combat+((AC42-1)*5)),0))","v":15},{"$f":"IF(A42=\"\",\"\",VLOOKUP('Character Equipment'!K11,weapons_table,16)+(E42*5)+IF(G67=\"\",0,G67)+IF(AC42>0,(combat+((AC42-1)*5)),0))","v":5},{"$f":"IF(A42=\"\",\"\",VLOOKUP('Character Equipment'!K11,weapons_table,17)+(E42*5)+IF(G67=\"\",0,G67)+IF(AC42>0,(combat+((AC42-1)*5)),0))","v":0},{"$f":"IF(A42=\"\",\"\",VLOOKUP('Character Equipment'!K11,weapons_table,18)+(E42*5)+IF(G67=\"\",0,G67)+IF(AC42>0,(combat+((AC42-1)*5)),0))","v":-5},{"$f":"IF(A42=\"\",\"\",IF((E42+damage_bonus)>0,CONCATENATE(VLOOKUP('Character Equipment'!K11,weapons_table,19),\"+\",(E42+damage_bonus)),IF((E42+damage_bonus)<0,CONCATENATE(VLOOKUP('Character Equipment'!K11,weapons_table,19),(E42+damage_bonus)),VLOOKUP('Character Equipment'!K11,weapons_table,19))))","v":"2d10"},null,{"$f":"IF(A42=\"\",\"\",IF(VLOOKUP('Character Equipment'!K11,weapons_table,3)=\"H\",vigor+2,IF(VLOOKUP('Character Equipment'!K11,weapons_table,3)=\"M\",vigor+1,IF(VLOOKUP('Character Equipment'!K11,weapons_table,3)=\"VL\",vigor-2,vigor))))","v":6},{"$f":"IF(A42=\"\",\"\",VLOOKUP('Character Equipment'!K11,weapons_table,21))","v":0},{"$f":"IF(A42=\"\",\"\",VLOOKUP('Character Equipment'!K11,weapons_table,22))","v":0},{"$f":"IF(A42=\"\",\"\",VLOOKUP('Character Equipment'!K11,weapons_table,23))","v":0},{"$f":"IF(A42=\"\",\"\",VLOOKUP('Character Equipment'!K11,weapons_table,24))","v":0},{"$f":"IF(A42=\"\",\"\",VLOOKUP('Character Equipment'!K11,weapons_table,25))","v":0},{"$f":"IF(ISERROR(VLOOKUP('Character Equipment'!K11,weapons_table,26)),\"\",VLOOKUP('Character Equipment'!K11,weapons_table,26))","v":"Hammers"},null,{"$f":"IF(ISERROR(VLOOKUP(VLOOKUP('Character Equipment'!K11,weapons_table,26),character_skill_table,6,FALSE)),0,VLOOKUP(VLOOKUP('Character Equipment'!K11,weapons_table,26),character_skill_table,6,FALSE))","v":0},"",0]
[{"$f":"IF('Character Equipment'!K12=\"\",\"\",IF('Character Equipment'!K12>1,IF(AC43<1,\"\",CHAR(186))&'Character Equipment'!L12))","v":"Maul"},{"$nulls":3},{"$f":"IF(A43=\"\",\"\",'Character Equipment'!S12)","v":0},{"$f":"IF(A43=\"\",\"\",VLOOKUP('Character Equipment'!K12,weapons_table,6)+E43+IF(AC43>0,AE43,0))","v":2},{"$f":"IF(A43=\"\",\"\",VLOOKUP('Character Equipment'!K12,weapons_table,7)+dexterity+E43)","v":30},{"$f":"IF(A43=\"\",\"\",VLOOKUP('Character Equipment'!K12,weapons_table,8)+(E43*5)+IF(G67=\"\",0,G67)+IF(AC43>0,(combat+((AC43-1)*5)),0))","v":20},{"$f":"IF(A43=\"\",\"\",VLOOKUP('Character Equipment'!K12,weapons_table,9)+(E43*5)+IF(G67=\"\",0,G67)+IF(AC43>0,(combat+((AC43-1)*5)),0))","v":20},{"$f":"IF(A43=\"\",\"\",VLOOKUP('Character Equipment'!K12,weapons_table,10)+(E43*5)+IF(G67=\"\",0,G67)+IF(AC43>0,(combat+((AC43-1)*5)),0))","v":20},{"$f":"IF(A43=\"\",\"\",VLOOKUP('Character Equipment'!K12,weapons_table,11)+(E43*5)+IF(G67=\"\",0,G67)+IF(AC43>0,(combat+((AC43-1)*5)),0))","v":20},{"$f":"IF(A43=\"\",\"\",VLOOKUP('Character Equipment'!K12,weapons_table,12)+(E43*5)+IF(G67=\"\",0,G67)+IF(AC43>0,(combat+((AC43-1)*5)),0))","v":20},{"$f":"IF(A43=\"\",\"\",VLOOKUP('Character Equipment'!K12,weapons_table,13)+(E43*5)+IF(G67=\"\",0,G67)+IF(AC43>0,(combat+((AC43-1)*5)),0))","v":25},{"$f":"IF(A43=\"\",\"\",VLOOKUP('Character Equipment'!K12,weapons_table,14)+(E43*5)+IF(G67=\"\",0,G67)+IF(AC43>0,(combat+((AC43-1)*5)),0))","v":20},{"$f":"IF(A43=\"\",\"\",VLOOKUP('Character Equipment'!K12,weapons_table,15)+(E43*5)+IF(G67=\"\",0,G67)+IF(AC43>0,(combat+((AC43-1)*5)),0))","v":15},{"$f":"IF(A43=\"\",\"\",VLOOKUP('Character Equipment'!K12,weapons_table,16)+(E43*5)+IF(G67=\"\",0,G67)+IF(AC43>0,(combat+((AC43-1)*5)),0))","v":10},{"$f":"IF(A43=\"\",\"\",VLOOKUP('Character Equipment'!K12,weapons_table,17)+(E43*5)+IF(G67=\"\",0,G67)+IF(AC43>0,(combat+((AC43-1)*5)),0))","v":5},{"$f":"IF(A43=\"\",\"\",VLOOKUP('Character Equipment'!K12,weapons_table,18)+(E43*5)+IF(G67=\"\",0,G67)+IF(AC43>0,(combat+((AC43-1)*5)),0))","v":-10},{"$f":"IF(A43=\"\",\"\",IF((E43+damage_bonus)>0,CONCATENATE(VLOOKUP('Character Equipment'!K12,weapons_table,19),\"+\",(E43+damage_bonus)),IF((E43+damage_bonus)<0,CONCATENATE(VLOOKUP('Character Equipment'!K12,weapons_table,19),(E43+damage_bonus)),VLOOKUP('Character Equipment'!K12,weapons_table,19))))","v":"2d10"},null,{"$f":"IF(A43=\"\",\"\",IF(VLOOKUP('Character Equipment'!K12,weapons_table,3)=\"H\",vigor+2,IF(VLOOKUP('Character Equipment'!K12,weapons_table,3)=\"M\",vigor+1,IF(VLOOKUP('Character Equipment'!K12,weapons_table,3)=\"VL\",vigor-2,vigor))))","v":6},{"$f":"IF(A43=\"\",\"\",VLOOKUP('Character Equipment'!K12,weapons_table,21))","v":0},{"$f":"IF(A43=\"\",\"\",VLOOKUP('Character Equipment'!K12,weapons_table,22))","v":0},{"$f":"IF(A43=\"\",\"\",VLOOKUP('Character Equipment'!K12,weapons_table,23))","v":0},{"$f":"IF(A43=\"\",\"\",VLOOKUP('Character Equipment'!K12,weapons_table,24))","v":0},{"$f":"IF(A43=\"\",\"\",VLOOKUP('Character Equipment'!K12,weapons_table,25))","v":0},{"$f":"IF(ISERROR(VLOOKUP('Character Equipment'!K12,weapons_table,26)),\"\",VLOOKUP('Character Equipment'!K12,weapons_table,26))","v":"Hammers"},null,{"$f":"IF(ISERROR(VLOOKUP(VLOOKUP('Character Equipment'!K12,weapons_table,26),character_skill_table,6,FALSE)),0,VLOOKUP(VLOOKUP('Character Equipment'!K12,weapons_table,26),character_skill_table,6,FALSE))","v":0},"",0]
[{"$f":"IF('Character Equipment'!K13=\"\",\"\",IF('Character Equipment'!K13>1,IF(AC44<1,\"\",CHAR(186))&'Character Equipment'!L13))","v":"Knife"},{"$nulls":3},{"$f":"IF(A44=\"\",\"\",'Character Equipment'!S13)","v":0},{"$f":"IF(A44=\"\",\"\",VLOOKUP('Character Equipment'!K13,weapons_table,6)+E44+IF(AC44>0,AE44,0))","v":4},{"$f":"IF(A44=\"\",\"\",VLOOKUP('Character Equipment'!K13,weapons_table,7)+dexterity+E44)","v":23.5},{"$f":"IF(A44=\"\",\"\",VLOOKUP('Character Equipment'!K13,weapons_table,8)+(E44*5)+IF(G67=\"\",0,G67)+IF(AC44>0,(combat+((AC44-1)*5)),0))","v":20},{"$f":"IF(A44=\"\",\"\",VLOOKUP('Character Equipment'!K13,weapons_table,9)+(E44*5)+IF(G67=\"\",0,G67)+IF(AC44>0,(combat+((AC44-1)*5)),0))","v":10},{"$f":"IF(A44=\"\",\"\",VLOOKUP('Character Equipment'!K13,weapons_table,10)+(E44*5)+IF(G67=\"\",0,G67)+IF(AC44>0,(combat+((AC44-1)*5)),0))","v":5},{"$f":"IF(A44=\"\",\"\",VLOOKUP('Character Equipment'!K13,weapons_table,11)+(E44*5)+IF(G67=\"\",0,G67)+IF(AC44>0,(combat+((AC44-1)*5)),0))","v":0},{"$f":"IF(A44=\"\",\"\",VLOOKUP('Character Equipment'!K13,weapons_table,12)+(E44*5)+IF(G67=\"\",0,G67)+IF(AC44>0,(combat+((AC44-1)*5)),0))","v":-5},{"$f":"IF(A44=\"\",\"\",VLOOKUP('Character Equipment'!K13,weapons_table,13)+(E44*5)+IF(G67=\"\",0,G67)+IF(AC44>0,(combat+((AC44-1)*5)),0))","v":-10},{"$f":"IF(A44=\"\",\"\",VLOOKUP('Character Equipment'!K13,weapons_table,14)+(E44*5)+IF(G67=\"\",0,G67)+IF(AC44>0,(combat+((AC44-1)*5)),0))","v":-15},{"$f":"IF(A44=\"\",\"\",VLOOKUP('Character Equipment'!K13,weapons_table,15)+(E44*5)+IF(G67=\"\",0,G67)+IF(AC44>0,(combat+((AC44-1)*5)),0))","v":-20},{"$f":"IF(A44=\"\",\"\",VLOOKUP('Character Equipment'!K13,weapons_table,16)+(E44*5)+IF(G67=\"\",0,G67)+IF(AC44>0,(combat+((AC44-1)*5)),0))","v":-20},{"$f":"IF(A44=\"\",\"\",VLOOKUP('Character Equipment'!K13,weapons_table,17)+(E44*5)+IF(G67=\"\",0,G67)+IF(AC44>0,(combat+((AC44-1)*5)),0))","v":-25},{"$f":"IF(A44=\"\",\"\",VLOOKUP('Character Equipment'!K13,weapons_table,18)+(E44*5)+IF(G67=\"\",0,G67)+IF(AC44>0,(combat+((AC44-1)*5)),0))","v":-30},{"$f":"IF(A44=\"\",\"\",IF((E44+damage_bonus)>0,CONCATENATE(VLOOKUP('Character Equipment'!K13,weapons_table,19),\"+\",(E44+damage_bonus)),IF((E44+damage_bonus)<0,CONCATENATE(VLOOKUP('Character Equipment'!K13,weapons_table,19),(E44+damage_bonus)),VLOOKUP('Character Equipment'!K13,weapons_table,19))))","v":"1d6"},null,{"$f":"IF(A44=\"\",\"\",IF(VLOOKUP('Character Equipment'!K13,weapons_table,3)=\"H\",vigor+2,IF(VLOOKUP('Character Equipment'!K13,weapons_table,3)=\"M\",vigor+1,IF(VLOOKUP('Character Equipment'!K13,weapons_table,3)=\"VL\",vigor-2,vigor))))","v":2},{"$f":"IF(A44=\"\",\"\",VLOOKUP('Character Equipment'!K13,weapons_table,21))","v":0},{"$f":"IF(A44=\"\",\"\",VLOOKUP('Character Equipment'!K13,weapons_table,22))","v":0},{"$f":"IF(A44=\"\",\"\",VLOOKUP('Character Equipment'!K13,weapons_table,23))","v":0},{"$f":"IF(A44=\"\",\"\",VLOOKUP('Character Equipment'!K13,weapons_table,24))","v":0},{"$f":"IF(A44=\"\",\"\",VLOOKUP('Character Equipment'!K13,weapons_table,25))","v":0},{"$f":"IF(ISERROR(VLOOKUP('Character Equipment'!K13,weapons_table,26)),\"\",VLOOKUP('Character Equipment'!K13,weapons_table,26))","v":"Knives"},null,{"$f":"IF(ISERROR(VLOOKUP(VLOOKUP('Character Equipment'!K13,weapons_table,26),character_skill_table,6,FALSE)),0,VLOOKUP(VLOOKUP('Character Equipment'!K13,weapons_table,26),character_skill_table,6,FALSE))","v":0},"",0]
[{"$nulls":53},{"$f":"IF(BB28=0,0,IF(ISERROR(MATCH(\"C\",OFFSET('Character Stats'!B24,SUM(AU29:AU33)+SUM(BB23:BB28),0,BD28,1),0)),0,MATCH(\"C\",OFFSET('Character Stats'!B24,SUM(AU29:AU33)+SUM(BB23:BB28),0,BD28,1),0)))","v":0},{"$f":"IF(BB45=0,\"\",BC28+BB45)","v":""},{"$f":"IF(BB45>0,53-BC45,0)","v":0}]
["Shield Weapon",{"$nulls":3},"Mg","#B","Int",0,1,2,3,4,5,6,7,8,9,10,"Dam",null,"Vig","s VL","s L","s M","s H","s P","sk",{"$f":"IF(BB46>0,INDIRECT(CONCATENATE(\"'Character Stats'!a\",BC46)),\"\")","v":""},"tr?","sk+com","com plus",null,null,{"$f":"IF(BB46>0,CONCATENATE(INDIRECT(CONCATENATE(\"'Character Stats'!f\",BC46)),\"|\",VLOOKUP(INDIRECT(CONCATENATE(\"'Character Stats'!d\",BC46)),Spell_Skills_by_number,15),\"|\",VLOOKUP(INDIRECT(CONCATENATE(\"'Character Stats'!d\",BC46)),Spell_Skills_by_number,17),\"|\",VLOOKUP(INDIRECT(CONCATENATE(\"'Character Stats'!d\",BC46)),Spell_Skills_by_number,16)),\"\")","v":""},{"$nulls":19},{"$f":"IF(BB45=0,0,IF(ISERROR(MATCH(\"C\",OFFSET('Character Stats'!B24,SUM(AU29:AU33)+SUM(BB23:BB45),0,BD45,1),0)),0,MATCH(\"C\",OFFSET('Character Stats'!B24,SUM(AU29:AU33)+SUM(BB23:BB45),0,BD45,1),0)))","v":0},{"$f":"IF(BB46=0,\"\",BC45+BB46)","v":""},{"$f":"IF(BB46>0,53-BC46,0)","v":0}]
[{"$f":"IF('Character Equipment'!$A$16=\"\",\"\",IF('Character Equipment'!$A$16>1,IF(AC47<1,\"\",CHAR(186))&'Character Equipment'!$B$16,\"\"))","v":"ºRondache"},{"$nulls":3},{"$f":"IF(A47=\"\",\"\",'Character Equipment'!I16)","v":0},{"$f":"IF(A47=\"\",\"\",VLOOKUP('Character Equipment'!A16,weapons_table,6)+E47+IF(AC47>0,AE47,0))","v":4},{"$f":"IF(A47=\"\",\"\",VLOOKUP('Character Equipment'!A16,weapons_table,7)+dexterity+E47)","v":24},{"$f":"IF(A47=\"\",\"\",VLOOKUP('Character Equipment'!A16,weapons_table,8)+(E47*5)+IF(G67=\"\",0,G67)+IF(AC47>0,(combat+((AC47-1)*5)),0))","v":61},{"$f":"IF(A47=\"\",\"\",VLOOKUP('Character Equipment'!A16,weapons_table,9)+(E47*5)+IF(G67=\"\",0,G67)+IF(AC47>0,(combat+((AC47-1)*5)),0))","v":51},{"$f":"IF(A47=\"\",\"\",VLOOKUP('Character Equipment'!A16,weapons_table,10)+(E47*5)+IF(G67=\"\",0,G67)+IF(AC47>0,(combat+((AC47-1)*5)),0))","v":46},{"$f":"IF(A47=\"\",\"\",VLOOKUP('Character Equipment'!A16,weapons_table,11)+(E47*5)+IF(G67=\"\",0,G67)+IF(AC47>0,(combat+((AC47-1)*5)),0))","v":41},{"$f":"IF(A47=\"\",\"\",VLOOKUP('Character Equipment'!A16,weapons_table,12)+(E47*5)+IF(G67=\"\",0,G67)+IF(AC47>0,(combat+((AC47-1)*5)),0))","v":36},{"$f":"IF(A47=\"\",\"\",VLOOKUP('Character Equipment'!A16,weapons_table,13)+(E47*5)+IF(G67=\"\",0,G67)+IF(AC47>0,(combat+((AC47-1)*5)),0))","v":26},{"$f":"IF(A47=\"\",\"\",VLOOKUP('Character Equipment'!A16,weapons_table,14)+(E47*5)+IF(G67=\"\",0,G67)+IF(AC47>0,(combat+((AC47-1)*5)),0))","v":21},{"$f":"IF(A47=\"\",\"\",VLOOKUP('Character Equipment'!A16,weapons_table,15)+(E47*5)+IF(G67=\"\",0,G67)+IF(AC47>0,(combat+((AC47-1)*5)),0))","v":16},{"$f":"IF(A47=\"\",\"\",VLOOKUP('Character Equipment'!A16,weapons_table,16)+(E47*5)+IF(G67=\"\",0,G67)+IF(AC47>0,(combat+((AC47-1)*5)),0))","v":16},{"$f":"IF(A47=\"\",\"\",VLOOKUP('Character Equipment'!A16,weapons_table,17)+(E47*5)+IF(G67=\"\",0,G67)+IF(AC47>0,(combat+((AC47-1)*5)),0))","v":11},{"$f":"IF(A47=\"\",\"\",VLOOKUP('Character Equipment'!A16,weapons_table,18)+(E47*5)+IF(G67=\"\",0,G67)+IF(AC47>0,(combat+((AC47-1)*5)),0))","v":11},{"$f":"IF(A47=\"\",\"\",IF((E47+damage_bonus)>0,CONCATENATE(VLOOKUP('Character Equipment'!A16,weapons_table,19),\"+\",(E47+damage_bonus)),IF((E47+damage_bonus)<0,CONCATENATE(VLOOKUP('Character Equipment'!A16,weapons_table,19),(E47+damage_bonus)),VLOOKUP('Character Equipment'!A16,weapons_table,19))))","v":"2d6"},null,{"$f":"IF(A47=\"\",\"\",IF(VLOOKUP('Character Equipment'!A16,weapons_table,3)=\"H\",vigor+2,IF(VLOOKUP('Character Equipment'!A16,weapons_table,3)=\"M\",vigor+1,IF(VLOOKUP('Character Equipment'!A16,weapons_table,3)=\"VL\",vigor-2,vigor))))","v":4},{"$f":"IF(A47=\"\",\"\",VLOOKUP('Character Equipment'!A16,weapons_table,21))","v":10},{"$f":"IF(A47=\"\",\"\",VLOOKUP('Character Equipment'!A16,weapons_table,22))","v":10},{"$f":"IF(A47=\"\",\"\",VLOOKUP('Character Equipment'!A16,weapons_table,23))","v":10},{"$f":"IF(A47=\"\",\"\",VLOOKUP('Character Equipment'!A16,weapons_table,24))","v":5},{"$f":"IF(A47=\"\",\"\",VLOOKUP('Character Equipment'!A16,weapons_table,25))","v":5},{"$f":"IF(ISERROR(VLOOKUP('Character Equipment'!A16,weapons_table,26)),\"\",VLOOKUP('Character Equipment'!A16,weapons_table,26))","v":"Shields"},{"$f":"IF(BB47>0,INDIRECT(CONCATENATE(\"'Character Stats'!a\",BC47)),\"\")","v":""},{"$f":"IF(ISERROR(VLOOKUP(VLOOKUP('Character Equipment'!A16,weapons_table,26),character_skill_table,6,FALSE)),0,VLOOKUP(VLOOKUP('Character Equipment'!A16,weapons_table,26),character_skill_table,6,FALSE))","v":2},{"$f":"IF(AC47>0,CONCATENATE(AA47,IF(combat<10,CONCATENATE(\"0\",combat),combat)),\"\")","v":"Shields16"},{"$f":"IF(AC47>0,VLOOKUP(AD47,combat_plus_table,3),0)","v":1},null,null,{"$f":"IF(BB47>0,CONCATENATE(INDIRECT(CONCATENATE(\"'Character Stats'!f\",BC47)),\"|\",VLOOKUP(INDIRECT(CONCATENATE(\"'Character Stats'!d\",BC47)),Spell_Skills_by_number,15),\"|\",VLOOKUP(INDIRECT(CONCATENATE(\"'Character Stats'!d\",BC47)),Spell_Skills_by_number,17),\"|\",VLOOKUP(INDIRECT(CONCATENATE(\"'Character Stats'!d\",BC47)),Spell_Skills_by_number,16)),\"\")","v":""},{"$nulls":19},{"$f":"IF(BB46=0,0,IF(ISERROR(MATCH(\"C\",OFFSET('Character Stats'!B24,SUM(AU29:AU33)+SUM(BB23:BB46),0,BD46,1),0)),0,MATCH(\"C\",OFFSET('Character Stats'!B24,SUM(AU29:AU33)+SUM(BB23:BB46),0,BD46,1),0)))","v":0},{"$f":"IF(BB47=0,\"\",BC46+BB47)","v":""},{"$f":"IF(BB47>0,53-BC47,0)","v":0}]
[{"$nulls":27},{"$f":"IF(BB48>0,INDIRECT(CONCATENATE(\"'Character Stats'!a\",BC48)),\"\")","v":""},{"$nulls":5},{"$f":"IF(BB48>0,CONCATENATE(INDIRECT(CONCATENATE(\"'Character Stats'!f\",BC48)),\"|\",VLOOKUP(INDIRECT(CONCATENATE(\"'Character Stats'!d\",BC48)),Spell_Skills_by_number,15),\"|\",VLOOKUP(INDIRECT(CONCATENATE(\"'Character Stats'!d\",BC48)),Spell_Skills_by_number,17),\"|\",VLOOKUP(INDIRECT(CONCATENATE(\"'Character Stats'!d\",BC48)),Spell_Skills_by_number,16)),\"\")","v":""},{"$nulls":19},{"$f":"IF(BB47=0,0,IF(ISERROR(MATCH(\"C\",OFFSET('Character Stats'!B24,SUM(AU29:AU33)+SUM(BB23:BB47),0,BD47,1),0)),0,MATCH(\"C\",OFFSET('Character Stats'!B24,SUM(AU29:AU33)+SUM(BB23:BB47),0,BD47,1),0)))","v":0},{"$f":"IF(BB48=0,\"\",BC47+BB48)","v":""},{"$f":"IF(BB48>0,53-BC48,0)","v":0}]
["Missile Weapons",{"$nulls":3},"Mg","#B","Int",0,1,2,3,4,5,6,7,8,9,10,"Dam",null,"Vig","-Rld",{"$nulls":5},{"$f":"IF(BB49>0,INDIRECT(CONCATENATE(\"'Character Stats'!a\",BC49)),\"\")","v":""},{"$nulls":5},{"$f":"IF(BB49>0,CONCATENATE(INDIRECT(CONCATENATE(\"'Character Stats'!f\",BC49)),\"|\",VLOOKUP(INDIRECT(CONCATENATE(\"'Character Stats'!d\",BC49)),Spell_Skills_by_number,15),\"|\",VLOOKUP(INDIRECT(CONCATENATE(\"'Character Stats'!d\",BC49)),Spell_Skills_by_number,17),\"|\",VLOOKUP(INDIRECT(CONCATENATE(\"'Character Stats'!d\",BC49)),Spell_Skills_by_number,16)),\"\")","v":""},{"$nulls":19},{"$f":"IF(BB48=0,0,IF(ISERROR(MATCH(\"C\",OFFSET('Character Stats'!B24,SUM(AU29:AU33)+SUM(BB24:BB48),0,BD48,1),0)),0,MATCH(\"C\",OFFSET('Character Stats'!B24,SUM(AU29:AU33)+SUM(BB24:BB48),0,BD48,1),0)))","v":0},{"$f":"IF(BB49=0,\"\",BC48+BB49)","v":""},{"$f":"IF(BB49>0,53-BC49,0)","v":0}]
[{"$f":"IF('Character Equipment'!K16=\"\",\"\",IF('Character Equipment'!K16>1,IF(AC50<1,\"\",CHAR(186))&'Character Equipment'!L16))","v":"Heavy Crossbow"},{"$nulls":3},{"$f":"IF(A50=\"\",\"\",'Character Equipment'!S16)","v":0},{"$f":"IF(A50=\"\",\"\",VLOOKUP('Character Equipment'!K16,weapons_table,6)+E50+IF(AC50>0,AE50,0))","v":0.5},{"$f":"IF(A50=\"\",\"\",dexterity+E50)","v":22},{"$f":"IF(A50=\"\",\"\",VLOOKUP('Character Equipment'!K16,weapons_table,8)+(E50*2.5)+IF(G67=\"\",0,G67)+IF(AC50>0,INT((combat/2)+((AC50-1)*2.5)),0))","v":45},{"$f":"IF(A50=\"\",\"\",VLOOKUP('Character Equipment'!K16,weapons_table,9)+(E50*2.5)+IF(G67=\"\",0,G67)+IF(AC50>0,INT((combat/2)+((AC50-1)*2.5)),0))","v":40},{"$f":"IF(A50=\"\",\"\",VLOOKUP('Character Equipment'!K16,weapons_table,10)+(E50*2.5)+IF(G67=\"\",0,G67)+IF(AC50>0,INT((combat/2)+((AC50-1)*2.5)),0))","v":40},{"$f":"IF(A50=\"\",\"\",VLOOKUP('Character Equipment'!K16,weapons_table,11)+(E50*2.5)+IF(G67=\"\",0,G67)+IF(AC50>0,INT((combat/2)+((AC50-1)*2.5)),0))","v":35},{"$f":"IF(A50=\"\",\"\",VLOOKUP('Character Equipment'!K16,weapons_table,12)+(E50*2.5)+IF(G67=\"\",0,G67)+IF(AC50>0,INT((combat/2)+((AC50-1)*2.5)),0))","v":30},{"$f":"IF(A50=\"\",\"\",VLOOKUP('Character Equipment'!K16,weapons_table,13)+(E50*2.5)+IF(G67=\"\",0,G67)+IF(AC50>0,INT((combat/2)+((AC50-1)*2.5)),0))","v":25},{"$f":"IF(A50=\"\",\"\",VLOOKUP('Character Equipment'!K16,weapons_table,14)+(E50*2.5)+IF(G67=\"\",0,G67)+IF(AC50>0,INT((combat/2)+((AC50-1)*2.5)),0))","v":25},{"$f":"IF(A50=\"\",\"\",VLOOKUP('Character Equipment'!K16,weapons_table,15)+(E50*2.5)+IF(G67=\"\",0,G67)+IF(AC50>0,INT((combat/2)+((AC50-1)*2.5)),0))","v":20},{"$f":"IF(A50=\"\",\"\",VLOOKUP('Character Equipment'!K16,weapons_table,16)+(E50*2.5)+IF(G67=\"\",0,G67)+IF(AC50>0,INT((combat/2)+((AC50-1)*2.5)),0))","v":15},{"$f":"IF(A50=\"\",\"\",VLOOKUP('Character Equipment'!K16,weapons_table,17)+(E50*2.5)+IF(G67=\"\",0,G67)+IF(AC50>0,INT((combat/2)+((AC50-1)*2.5)),0))","v":10},{"$f":"IF(A50=\"\",\"\",VLOOKUP('Character Equipment'!K16,weapons_table,18)+(E50*2.5)+IF(G67=\"\",0,G67)+IF(AC50>0,INT((combat/2)+((AC50-1)*2.5)),0))","v":5},{"$f":"IF(A50=\"\",\"\",IF((E50+damage_bonus)>0,CONCATENATE(VLOOKUP('Character Equipment'!K16,weapons_table,19),\"+\",(E50+damage_bonus)),IF((E50+damage_bonus)<0,CONCATENATE(VLOOKUP('Character Equipment'!K16,weapons_table,19),(E50+damage_bonus)),VLOOKUP('Character Equipment'!K16,weapons_table,19))))","v":"1d10+7"},null,{"$f":"IF(A50=\"\",\"\",VLOOKUP('Character Equipment'!K16,weapons_table,21))","v":5},{"$f":"IF(AA50=\"Crossbows\",IF(dexterity>15,dexterity-15,\"\"),\"\")","v":7},{"$nulls":4},{"$f":"IF(ISERROR(VLOOKUP('Character Equipment'!K16,weapons_table,26)),\"\",VLOOKUP('Character Equipment'!K16,weapons_table,26))","v":"Crossbows"},null,{"$f":"IF(ISERROR(VLOOKUP(VLOOKUP('Character Equipment'!K16,weapons_table,26),character_skill_table,6,FALSE)),0,VLOOKUP(VLOOKUP('Character Equipment'!K16,weapons_table,26),character_skill_table,6,FALSE))","v":0},{"$f":"IF(AC50>0,CONCATENATE(AA50,IF(dexterity<10,CONCATENATE(\"0\",dexterity),dexterity)),\"\")","v":""},{"$f":"IF(AC50>0,VLOOKUP(AD50,missle_combat_plus_table,3),0)","v":0}]
[{"$f":"IF('Character Equipment'!K17=\"\",\"\",IF('Character Equipment'!K17>1,IF(AC51<1,\"\",CHAR(186))&'Character Equipment'!L17))","v":"Chakra"},{"$nulls":3},{"$f":"IF(A51=\"\",\"\",'Character Equipment'!S17)","v":0},{"$f":"IF(A51=\"\",\"\",VLOOKUP('Character Equipment'!K17,weapons_table,6)+E51+IF(AC51>0,AE51,0))","v":5},{"$f":"IF(A51=\"\",\"\",dexterity+E51)","v":22},{"$f":"IF(A51=\"\",\"\",VLOOKUP('Character Equipment'!K17,weapons_table,8)+(E51*2.5)+IF(G67=\"\",0,G67)+IF(AC51>0,INT((combat/2)+((AC51-1)*2.5)),0))","v":45},{"$f":"IF(A51=\"\",\"\",VLOOKUP('Character Equipment'!K17,weapons_table,9)+(E51*2.5)+IF(G67=\"\",0,G67)+IF(AC51>0,INT((combat/2)+((AC51-1)*2.5)),0))","v":45},{"$f":"IF(A51=\"\",\"\",VLOOKUP('Character Equipment'!K17,weapons_table,10)+(E51*2.5)+IF(G67=\"\",0,G67)+IF(AC51>0,INT((combat/2)+((AC51-1)*2.5)),0))","v":40},{"$f":"IF(A51=\"\",\"\",VLOOKUP('Character Equipment'!K17,weapons_table,11)+(E51*2.5)+IF(G67=\"\",0,G67)+IF(AC51>0,INT((combat/2)+((AC51-1)*2.5)),0))","v":30},{"$f":"IF(A51=\"\",\"\",VLOOKUP('Character Equipment'!K17,weapons_table,12)+(E51*2.5)+IF(G67=\"\",0,G67)+IF(AC51>0,INT((combat/2)+((AC51-1)*2.5)),0))","v":20},{"$f":"IF(A51=\"\",\"\",VLOOKUP('Character Equipment'!K17,weapons_table,13)+(E51*2.5)+IF(G67=\"\",0,G67)+IF(AC51>0,INT((combat/2)+((AC51-1)*2.5)),0))","v":0},{"$f":"IF(A51=\"\",\"\",VLOOKUP('Character Equipment'!K17,weapons_table,14)+(E51*2.5)+IF(G67=\"\",0,G67)+IF(AC51>0,INT((combat/2)+((AC51-1)*2.5)),0))","v":-10},{"$f":"IF(A51=\"\",\"\",VLOOKUP('Character Equipment'!K17,weapons_table,15)+(E51*2.5)+IF(G67=\"\",0,G67)+IF(AC51>0,INT((combat/2)+((AC51-1)*2.5)),0))","v":-15},{"$f":"IF(A51=\"\",\"\",VLOOKUP('Character Equipment'!K17,weapons_table,16)+(E51*2.5)+IF(G67=\"\",0,G67)+IF(AC51>0,INT((combat/2)+((AC51-1)*2.5)),0))","v":-20},{"$f":"IF(A51=\"\",\"\",VLOOKUP('Character Equipment'!K17,weapons_table,17)+(E51*2.5)+IF(G67=\"\",0,G67)+IF(AC51>0,INT((combat/2)+((AC51-1)*2.5)),0))","v":-25},{"$f":"IF(A51=\"\",\"\",VLOOKUP('Character Equipment'!K17,weapons_table,18)+(E51*2.5)+IF(G67=\"\",0,G67)+IF(AC51>0,INT((combat/2)+((AC51-1)*2.5)),0))","v":-35},{"$f":"IF(A51=\"\",\"\",IF((E51+damage_bonus)>0,CONCATENATE(VLOOKUP('Character Equipment'!K17,weapons_table,19),\"+\",(E51+damage_bonus)),IF((E51+damage_bonus)<0,CONCATENATE(VLOOKUP('Character Equipment'!K17,weapons_table,19),(E51+damage_bonus)),VLOOKUP('Character Equipment'!K17,weapons_table,19))))","v":"1d3+(p)"},null,{"$f":"IF(A51=\"\",\"\",VLOOKUP('Character Equipment'!K17,weapons_table,21))","v":2},{"$f":"IF(AA51=\"Crossbows\",IF(dexterity>15,dexterity-15,\"\"),\"\")","v":""},{"$nulls":4},{"$f":"IF(ISERROR(VLOOKUP('Character Equipment'!K17,weapons_table,26)),\"\",VLOOKUP('Character Equipment'!K17,weapons_table,26))","v":"Eastern Hand Darts"},null,{"$f":"IF(ISERROR(VLOOKUP(VLOOKUP('Character Equipment'!K17,weapons_table,26),character_skill_table,6,FALSE)),0,VLOOKUP(VLOOKUP('Character Equipment'!K17,weapons_table,26),character_skill_table,6,FALSE))","v":0},{"$f":"IF(AC51>0,CONCATENATE(AA51,IF(dexterity<10,CONCATENATE(\"0\",dexterity),dexterity)),\"\")","v":""},{"$f":"IF(AC51>0,VLOOKUP(AD51,missle_combat_plus_table,3),0)","v":0}]
[{"$f":"IF('Character Equipment'!K18=\"\",\"\",IF('Character Equipment'!K18>1,IF(AC52<1,\"\",CHAR(186))&'Character Equipment'!L18))","v":"Composite bow"},{"$nulls":3},{"$f":"IF(A52=\"\",\"\",'Character Equipment'!S18)","v":0},{"$f":"IF(A52=\"\",\"\",VLOOKUP('Character Equipment'!K18,weapons_table,6)+E52+IF(AC52>0,AE52,0))","v":2},{"$f":"IF(A52=\"\",\"\",dexterity+E52)","v":22},{"$f":"IF(A52=\"\",\"\",VLOOKUP('Character Equipment'!K18,weapons_table,8)+(E52*2.5)+IF(G67=\"\",0,G67)+IF(AC52>0,INT((combat/2)+((AC52-1)*2.5)),0))","v":45},{"$f":"IF(A52=\"\",\"\",VLOOKUP('Character Equipment'!K18,weapons_table,9)+(E52*2.5)+IF(G67=\"\",0,G67)+IF(AC52>0,INT((combat/2)+((AC52-1)*2.5)),0))","v":45},{"$f":"IF(A52=\"\",\"\",VLOOKUP('Character Equipment'!K18,weapons_table,10)+(E52*2.5)+IF(G67=\"\",0,G67)+IF(AC52>0,INT((combat/2)+((AC52-1)*2.5)),0))","v":40},{"$f":"IF(A52=\"\",\"\",VLOOKUP('Character Equipment'!K18,weapons_table,11)+(E52*2.5)+IF(G67=\"\",0,G67)+IF(AC52>0,INT((combat/2)+((AC52-1)*2.5)),0))","v":30},{"$f":"IF(A52=\"\",\"\",VLOOKUP('Character Equipment'!K18,weapons_table,12)+(E52*2.5)+IF(G67=\"\",0,G67)+IF(AC52>0,INT((combat/2)+((AC52-1)*2.5)),0))","v":25},{"$f":"IF(A52=\"\",\"\",VLOOKUP('Character Equipment'!K18,weapons_table,13)+(E52*2.5)+IF(G67=\"\",0,G67)+IF(AC52>0,INT((combat/2)+((AC52-1)*2.5)),0))","v":20},{"$f":"IF(A52=\"\",\"\",VLOOKUP('Character Equipment'!K18,weapons_table,14)+(E52*2.5)+IF(G67=\"\",0,G67)+IF(AC52>0,INT((combat/2)+((AC52-1)*2.5)),0))","v":15},{"$f":"IF(A52=\"\",\"\",VLOOKUP('Character Equipment'!K18,weapons_table,15)+(E52*2.5)+IF(G67=\"\",0,G67)+IF(AC52>0,INT((combat/2)+((AC52-1)*2.5)),0))","v":10},{"$f":"IF(A52=\"\",\"\",VLOOKUP('Character Equipment'!K18,weapons_table,16)+(E52*2.5)+IF(G67=\"\",0,G67)+IF(AC52>0,INT((combat/2)+((AC52-1)*2.5)),0))","v":5},{"$f":"IF(A52=\"\",\"\",VLOOKUP('Character Equipment'!K18,weapons_table,17)+(E52*2.5)+IF(G67=\"\",0,G67)+IF(AC52>0,INT((combat/2)+((AC52-1)*2.5)),0))","v":0},{"$f":"IF(A52=\"\",\"\",VLOOKUP('Character Equipment'!K18,weapons_table,18)+(E52*2.5)+IF(G67=\"\",0,G67)+IF(AC52>0,INT((combat/2)+((AC52-1)*2.5)),0))","v":-5},{"$f":"IF(A52=\"\",\"\",IF((E52+damage_bonus)>0,CONCATENATE(VLOOKUP('Character Equipment'!K18,weapons_table,19),\"+\",(E52+damage_bonus)),IF((E52+damage_bonus)<0,CONCATENATE(VLOOKUP('Character Equipment'!K18,weapons_table,19),(E52+damage_bonus)),VLOOKUP('Character Equipment'!K18,weapons_table,19))))","v":"1d10+5"},null,{"$f":"IF(A52=\"\",\"\",VLOOKUP('Character Equipment'!K18,weapons_table,21))","v":4},{"$f":"IF(AA52=\"Crossbows\",IF(dexterity>15,dexterity-15,\"\"),\"\")","v":""},{"$nulls":4},{"$f":"IF(ISERROR(VLOOKUP('Character Equipment'!K18,weapons_table,26)),\"\",VLOOKUP('Character Equipment'!K18,weapons_table,26))","v":"Self Bows"},null,{"$f":"IF(ISERROR(VLOOKUP(VLOOKUP('Character Equipment'!K18,weapons_table,26),character_skill_table,6,FALSE)),0,VLOOKUP(VLOOKUP('Character Equipment'!K18,weapons_table,26),character_skill_table,6,FALSE))","v":0},{"$f":"IF(AC52>0,CONCATENATE(AA52,IF(dexterity<10,CONCATENATE(\"0\",dexterity),dexterity)),\"\")","v":""},{"$f":"IF(AC52>0,VLOOKUP(AD52,missle_combat_plus_table,3),0)","v":0}]
[{"$f":"IF('Character Equipment'!K19=\"\",\"\",IF('Character Equipment'!K19>1,IF(AC53<1,\"\",CHAR(186))&'Character Equipment'!L19))","v":"Javelin"},{"$nulls":3},{"$f":"IF(A53=\"\",\"\",'Character Equipment'!S19)","v":0},{"$f":"IF(A53=\"\",\"\",VLOOKUP('Character Equipment'!K19,weapons_table,6)+E53+IF(AC53>0,AE53,0))","v":2},{"$f":"IF(A53=\"\",\"\",dexterity+E53)","v":22},{"$f":"IF(A53=\"\",\"\",VLOOKUP('Character Equipment'!K19,weapons_table,8)+(E53*2.5)+IF(G67=\"\",0,G67)+IF(AC53>0,INT((combat/2)+((AC53-1)*2.5)),0))","v":40},{"$f":"IF(A53=\"\",\"\",VLOOKUP('Character Equipment'!K19,weapons_table,9)+(E53*2.5)+IF(G67=\"\",0,G67)+IF(AC53>0,INT((combat/2)+((AC53-1)*2.5)),0))","v":40},{"$f":"IF(A53=\"\",\"\",VLOOKUP('Character Equipment'!K19,weapons_table,10)+(E53*2.5)+IF(G67=\"\",0,G67)+IF(AC53>0,INT((combat/2)+((AC53-1)*2.5)),0))","v":35},{"$f":"IF(A53=\"\",\"\",VLOOKUP('Character Equipment'!K19,weapons_table,11)+(E53*2.5)+IF(G67=\"\",0,G67)+IF(AC53>0,INT((combat/2)+((AC53-1)*2.5)),0))","v":30},{"$f":"IF(A53=\"\",\"\",VLOOKUP('Character Equipment'!K19,weapons_table,12)+(E53*2.5)+IF(G67=\"\",0,G67)+IF(AC53>0,INT((combat/2)+((AC53-1)*2.5)),0))","v":30},{"$f":"IF(A53=\"\",\"\",VLOOKUP('Character Equipment'!K19,weapons_table,13)+(E53*2.5)+IF(G67=\"\",0,G67)+IF(AC53>0,INT((combat/2)+((AC53-1)*2.5)),0))","v":30},{"$f":"IF(A53=\"\",\"\",VLOOKUP('Character Equipment'!K19,weapons_table,14)+(E53*2.5)+IF(G67=\"\",0,G67)+IF(AC53>0,INT((combat/2)+((AC53-1)*2.5)),0))","v":25},{"$f":"IF(A53=\"\",\"\",VLOOKUP('Character Equipment'!K19,weapons_table,15)+(E53*2.5)+IF(G67=\"\",0,G67)+IF(AC53>0,INT((combat/2)+((AC53-1)*2.5)),0))","v":15},{"$f":"IF(A53=\"\",\"\",VLOOKUP('Character Equipment'!K19,weapons_table,16)+(E53*2.5)+IF(G67=\"\",0,G67)+IF(AC53>0,INT((combat/2)+((AC53-1)*2.5)),0))","v":10},{"$f":"IF(A53=\"\",\"\",VLOOKUP('Character Equipment'!K19,weapons_table,17)+(E53*2.5)+IF(G67=\"\",0,G67)+IF(AC53>0,INT((combat/2)+((AC53-1)*2.5)),0))","v":10},{"$f":"IF(A53=\"\",\"\",VLOOKUP('Character Equipment'!K19,weapons_table,18)+(E53*2.5)+IF(G67=\"\",0,G67)+IF(AC53>0,INT((combat/2)+((AC53-1)*2.5)),0))","v":5},{"$f":"IF(A53=\"\",\"\",IF((E53+damage_bonus)>0,CONCATENATE(VLOOKUP('Character Equipment'!K19,weapons_table,19),\"+\",(E53+damage_bonus)),IF((E53+damage_bonus)<0,CONCATENATE(VLOOKUP('Character Equipment'!K19,weapons_table,19),(E53+damage_bonus)),VLOOKUP('Character Equipment'!K19,weapons_table,19))))","v":"1d8"},null,{"$f":"IF(A53=\"\",\"\",VLOOKUP('Character Equipment'!K19,weapons_table,21))","v":4},{"$f":"IF(AA53=\"Crossbows\",IF(dexterity>15,dexterity-15,\"\"),\"\")","v":""},{"$nulls":4},{"$f":"IF(ISERROR(VLOOKUP('Character Equipment'!K19,weapons_table,26)),\"\",VLOOKUP('Character Equipment'!K19,weapons_table,26))","v":"Thrown Weapons"},null,{"$f":"IF(ISERROR(VLOOKUP(VLOOKUP('Character Equipment'!K19,weapons_table,26),character_skill_table,6,FALSE)),0,VLOOKUP(VLOOKUP('Character Equipment'!K19,weapons_table,26),character_skill_table,6,FALSE))","v":0},{"$f":"IF(AC53>0,CONCATENATE(AA53,IF(dexterity<10,CONCATENATE(\"0\",dexterity),dexterity)),\"\")","v":""},{"$f":"IF(AC53>0,VLOOKUP(AD53,missle_combat_plus_table,3),0)","v":0}]
{"$rows_empty":9}
["Encumberance",{"$nulls":3},"Carry",null,"Combat",null,"Stamina Recovery",{"$nulls":3},"Hour 1",null,"Hour +"]
["% Load",{"$nulls":3},{"$f":"('Character Equipment'!I6*100)","v":47.53184713375796},null,{"$f":"('Character Equipment'!O6*100)","v":47.53184713375796},null,"Walking",{"$nulls":3},{"$f":"TRUNC(O64/2)","v":0},null,{"$f":"INT(constitution/10)","v":0}]
["Tests By",{"$nulls":3},{"$f":"IF(VLOOKUP(E64,encumberance_table,2)=0,\"\",VLOOKUP(E64,encumberance_table,2))","v":""},null,{"$f":"IF(VLOOKUP(G64,encumberance_table,2)=0,\"\",VLOOKUP(G64,encumberance_table,2))","v":""},null,"Resting",{"$nulls":3},{"$f":"TRUNC(O65/2)","v":0},null,{"$f":"INT(constitution/3)","v":1}]
["Tests Against",{"$nulls":3},{"$f":"IF(VLOOKUP(E64,encumberance_table,3)=0,\"\",VLOOKUP(E64,encumberance_table,3))","v":""},null,{"$f":"IF(VLOOKUP(G64,encumberance_table,3)=0,\"\",VLOOKUP(G64,encumberance_table,3))","v":""},null,"Sleeping",{"$nulls":3},{"$f":"TRUNC(O66/2)","v":1},null,{"$f":"INT(constitution/2)","v":2}]
["COMBAT","By",null,null,{"$f":"IF(VLOOKUP(E64,encumberance_table,4)=0,\"\",VLOOKUP(E64,encumberance_table,4))","v":""},null,{"$f":"IF(VLOOKUP(G64,encumberance_table,4)=0,\"\",VLOOKUP(G64,encumberance_table,4))","v":""},null,"Body Recovery",{"$nulls":5},"Day"]
[null,"Against",null,null,{"$f":"IF(VLOOKUP(E64,encumberance_table,5)=0,\"\",VLOOKUP(E64,encumberance_table,5))","v":""},null,{"$f":"IF(VLOOKUP(G64,encumberance_table,5)=0,\"\",VLOOKUP(G64,encumberance_table,5))","v":""},null,"Strenuous",{"$nulls":5},{"$f":"INT((constitution-10)/5)","v":-1}]
[null,"Stamina",null,null,{"$f":"VLOOKUP(E64,encumberance_table,6)","v":"1/turn"},null,{"$f":"VLOOKUP(G64,encumberance_table,6)","v":"1/turn"},null,"Moderate",{"$nulls":5},{"$f":"INT((constitution-10)/3)","v":-2}]
["Travel Stamina",{"$nulls":3},{"$f":"VLOOKUP(E64,encumberance_table,7)","v":"2/hour"},null,{"$f":"VLOOKUP(G64,encumberance_table,7)","v":"2/hour"},null,"Resting",{"$nulls":5},{"$f":"INT(constitution/5)","v":1}]

{"sheet":"Character Equipment","index":1,"n_rows":56,"n_cols":21,"rows_kept":56,"merged":[[2,17,2,18],[3,20,6,20],[4,2,4,3],[7,1,7,4],[7,11,7,14],[8,1,8,4],[8,11,8,14],[9,11,9,14],[10,11,10,14],[11,1,11,4],[11,11,11,14],[12,1,12,4],[12,11,12,14],[15,1,15,4],[15,11,15,14],[16,11,16,14],[17,11,17,14],[18,11,18,14]]}
["Enter the Equipment Item # from the equipment list in the green field.  For general equipment enter the quantity, for weapons enter any plus's "]
[]
["Character Name",null,null,{"$f":"character_name","v":"TBA"},{"$nulls":4},"Player Name",null,{"$f":"player_name","v":"4.2 Beta"},{"$nulls":5},"Date ",{"$f":"NOW()","v":"2015-08-19T15:38:35.760"}]
[{"$nulls":20},"OPT: Restrict weapon choices by type. Then choose weapon."]
["Equipment Cost",null,{"$f":"SUM(G8:G53)+SUM(Q8:Q53)","v":1113},null,null,"Total Carried Weight",null,null,{"$f":"SUM(F8:F53)+SUM(P8:P53)","v":{"v":149.25,"d":"149.3"}},"lb",null,"Combat Carried Weight",null,null,{"$f":"I5-(SUM(J21:J53)+SUM(T21:T53))","v":{"v":149.25,"d":"149.3"}},"lb"]
[{"$nulls":5},"Total Encumberance",null,null,{"$f":"I5/carryingcap","v":{"v":0.4753184713375796,"d":"48%"}},null,null,"Combat Encumberance","Encumberance",null,{"$f":"O5/carryingcap","v":{"v":0.4753184713375796,"d":"48%"}}]
["Body Armour",null,null,"Description",null,"Weight","Cost",null,"Magic +",null,"Melee Weapons",null,null,"Description",null,"Weight","Cost","Size","Magic +"]
[{"$f":"IF(B8=\"\",\"\",VLOOKUP(B8,Armorcode,2))","v":9},"Cuirass",{"$nulls":3},{"$f":"IF(A8=\"\",\"\",VLOOKUP(A8,body_armour_table,5)*weight)","v":57},{"$f":"IF(A8=\"\",\"\",VLOOKUP(A8,body_armour_table,4))","v":200},{"$nulls":3},{"$f":"IF(L8=\"\",\"\",VLOOKUP(L8,weaponcode,2))","v":37},"Short Sword",{"$nulls":3},{"$f":"IF(K8=\"\",\"\",VLOOKUP(K8,weapons_table,5))","v":5},{"$f":"IF(K8=\"\",\"\",VLOOKUP(K8,weapons_table,4))","v":65},{"$f":"IF(K8=\"\",\"\",VLOOKUP(K8,weapons_table,7))","v":3},null,{"$f":"IF(ISERROR(VLOOKUP(VLOOKUP('Character Equipment'!K8,weapons_table,26),character_skill_table,6,FALSE)),0,VLOOKUP(VLOOKUP('Character Equipment'!K8,weapons_table,26),character_skill_table,6,FALSE))","v":0},"All Weapons"]
[{"$f":"IF(B9=\"\",\"\",VLOOKUP(B9,Surcoatcode,2))","v":14},"None",{"$nulls":3},{"$f":"IF(A9=\"\",\"\",IF(A9>12,VLOOKUP(A9,body_armour_table,5)*weight,\"\"))","v":0},{"$f":"IF(A9=\"\",\"\",VLOOKUP(A9,body_armour_table,4))","v":0},{"$nulls":3},66,"Warhammer",{"$nulls":3},10,50,5,null,{"$f":"IF(ISERROR(VLOOKUP(VLOOKUP('Character Equipment'!K9,weapons_table,26),character_skill_table,6,FALSE)),0,VLOOKUP(VLOOKUP('Character Equipment'!K9,weapons_table,26),character_skill_table,6,FALSE))","v":0},"Hammers"]
[{"$nulls":10},72,"Maul",{"$nulls":3},12,75,8,null,{"$f":"IF(ISERROR(VLOOKUP(VLOOKUP('Character Equipment'!K10,weapons_table,26),character_skill_table,6,FALSE)),0,VLOOKUP(VLOOKUP('Character Equipment'!K10,weapons_table,26),character_skill_table,6,FALSE))","v":0},"Hammers"]
["Head Armour",null,null,"Description",null,"Weight","Cost",null,"Magic +",null,78,"Two-Handed Warhammer",{"$nulls":3},12,100,6,null,{"$f":"IF(ISERROR(VLOOKUP(VLOOKUP('Character Equipment'!K11,weapons_table,26),character_skill_table,6,FALSE)),0,VLOOKUP(VLOOKUP('Character Equipment'!K11,weapons_table,26),character_skill_table,6,FALSE))","v":0},"Hammers"]
[{"$f":"IF(B12=\"\",\"\",VLOOKUP(B12,helmcode,2))","v":20},"Norman Helm",{"$nulls":3},{"$f":"IF(A12=\"\",\"\",VLOOKUP(A12,head_armour_table,5))","v":4},{"$f":"IF(A12=\"\",\"\",VLOOKUP(A12,head_armour_table,4))","v":40},{"$nulls":3},72,"Maul",{"$nulls":3},12,75,8,null,{"$f":"IF(ISERROR(VLOOKUP(VLOOKUP('Character Equipment'!K12,weapons_table,26),character_skill_table,6,FALSE)),0,VLOOKUP(VLOOKUP('Character Equipment'!K12,weapons_table,26),character_skill_table,6,FALSE))","v":0},"Hammers"]
[{"$f":"IF(B13=\"\",\"\",VLOOKUP(B13,coifcode,2))","v":26},"Leather Hood",{"$nulls":3},{"$f":"IF(A13=\"\",\"\",VLOOKUP(A13,head_armour_table,5))","v":2},{"$f":"IF(A13=\"\",\"\",VLOOKUP(A13,head_armour_table,4))","v":5},{"$nulls":3},29,"Knife",{"$nulls":3},2,18,1.5,null,{"$f":"IF(ISERROR(VLOOKUP(VLOOKUP('Character Equipment'!K13,weapons_table,26),character_skill_table,6,FALSE)),0,VLOOKUP(VLOOKUP('Character Equipment'!K13,weapons_table,26),character_skill_table,6,FALSE))","v":0},"Hammers"]
[]
["Shield Weapon",null,null,"Description",null,"Weight","Cost","Size","Magic +",null,"Missile Weapons",null,null,"Description",null,"Weight","Cost",null,"Magic +"]
[{"$f":"IF(B16=\"\",\"\",VLOOKUP(B16,shieldcode,2))","v":96},"Rondache",{"$nulls":3},{"$f":"IF($A16=\"\",\"\",VLOOKUP(A16,weapons_table,5))","v":7},{"$f":"IF(A16=\"\",\"\",VLOOKUP(A16,weapons_table,23))","v":10},{"$f":"IF(A16=\"\",\"\",VLOOKUP(A16,weapons_table,6))","v":3},null,null,{"$f":"IF(L16=\"\",\"\",VLOOKUP(L16,missilecode,2))","v":108},"Heavy Crossbow",{"$nulls":3},{"$f":"IF(K16=\"\",\"\",VLOOKUP(K16,weapons_table,5))","v":20},{"$f":"IF(K16=\"\",\"\",VLOOKUP(K16,weapons_table,4))","v":250},null,null,{"$f":"IF(ISERROR(VLOOKUP(VLOOKUP('Character Equipment'!K16,weapons_table,26),character_skill_table,6,FALSE)),0,VLOOKUP(VLOOKUP('Character Equipment'!K16,weapons_table,26),character_skill_table,6,FALSE))","v":0},"Crossbows"]
[{"$nulls":10},{"$f":"IF(L17=\"\",\"\",VLOOKUP(L17,missilecode,2))","v":120},"Chakra",{"$nulls":3},{"$f":"IF(K17=\"\",\"\",VLOOKUP(K17,weapons_table,5))","v":0.25},{"$f":"IF(K17=\"\",\"\",VLOOKUP(K17,weapons_table,4))","v":40},null,null,{"$f":"IF(ISERROR(VLOOKUP(VLOOKUP('Character Equipment'!K17,weapons_table,26),character_skill_table,6,FALSE)),0,VLOOKUP(VLOOKUP('Character Equipment'!K17,weapons_table,26),character_skill_table,6,FALSE))","v":0},"Eastern Hand Darts"]
[{"$nulls":10},{"$f":"IF(L18=\"\",\"\",VLOOKUP(L18,missilecode,2))","v":111},"Composite bow",{"$nulls":3},{"$f":"IF(K18=\"\",\"\",VLOOKUP(K18,weapons_table,5))","v":3},{"$f":"IF(K18=\"\",\"\",VLOOKUP(K18,weapons_table,4))","v":125},null,null,{"$f":"IF(ISERROR(VLOOKUP(VLOOKUP('Character Equipment'!K18,weapons_table,26),character_skill_table,6,FALSE)),0,VLOOKUP(VLOOKUP('Character Equipment'!K18,weapons_table,26),character_skill_table,6,FALSE))","v":0},"Self Bows"]
[{"$nulls":10},{"$f":"IF(L19=\"\",\"\",VLOOKUP(L19,missilecode,2))","v":124},"Javelin",{"$nulls":3},{"$f":"IF(K19=\"\",\"\",VLOOKUP(K19,weapons_table,5))","v":3},{"$f":"IF(K19=\"\",\"\",VLOOKUP(K19,weapons_table,4))","v":60},null,null,{"$f":"IF(ISERROR(VLOOKUP(VLOOKUP('Character Equipment'!K19,weapons_table,26),character_skill_table,6,FALSE)),0,VLOOKUP(VLOOKUP('Character Equipment'!K19,weapons_table,26),character_skill_table,6,FALSE))","v":0},"Thrown Weapons"]
["Equipment",null,"Description",null,null,"Weight","Cost","In Pack","Quantity"]
[null,{"$f":"IF(A21=\"\",\"\",VLOOKUP(A21,equipment_table,2))","v":""},{"$nulls":3},{"$f":"IF(A21=\"\",\"\",VLOOKUP(A21,equipment_table,5)*IF(I21=0,1,I21))","v":""},{"$f":"IF(A21=\"\",\"\",VLOOKUP(A21,equipment_table,4)*IF(I21=0,1,I21))","v":""},null,null,{"$f":"IF(H21<>\"\",F21,0)","v":0},"Equipment",null,"Description",null,null,"Weight","Cost","In Pack","Quantity"]
[null,"",{"$nulls":3},"","",null,null,{"$f":"IF(H22<>\"\",F22,0)","v":0},null,{"$f":"IF(K22=\"\",\"\",VLOOKUP(K22,equipment_table,2))","v":""},{"$nulls":3},{"$f":"IF(K22=\"\",\"\",VLOOKUP(K22,equipment_table,5)*IF(S22=0,1,S22))","v":""},{"$f":"IF(K22=\"\",\"\",VLOOKUP(K22,equipment_table,4)*IF(S22=0,1,S22))","v":""},null,null,{"$f":"IF(R24<>\"\",P24,0)","v":0}]
[null,"",{"$nulls":3},"","",null,null,0,null,"",{"$nulls":3},{"$f":"IF(K23=\"\",\"\",VLOOKUP(K23,equipment_table,5)*IF(S23=0,1,S23))","v":""},{"$f":"IF(K23=\"\",\"\",VLOOKUP(K23,equipment_table,4)*IF(S23=0,1,S23))","v":""},null,null,0]
[null,"",{"$nulls":3},"","",null,null,0,null,"",{"$nulls":3},"","",null,null,0]
[null,"",{"$nulls":3},"","",null,null,0,null,"",{"$nulls":3},"","",null,null,0]
[null,"",{"$nulls":3},"","",null,null,0,null,"",{"$nulls":3},"","",null,null,0]
[null,"",{"$nulls":3},"","",null,null,0,null,"",{"$nulls":3},"","",null,null,0]
[null,"",{"$nulls":3},"","",null,null,0,null,"",{"$nulls":3},"","",null,null,0]
[null,"",{"$nulls":3},"","",null,null,0,null,"",{"$nulls":3},"",{"$nulls":3},0]
[null,"",{"$nulls":3},"","",null,null,0,null,"",{"$nulls":3},"","",null,null,0]
[null,"",{"$nulls":3},"","",null,null,0,null,"",{"$nulls":3},"","",null,null,0]
[null,"",{"$nulls":3},"","",null,null,0,null,"",{"$nulls":3},"","",null,null,0]
[null,"",{"$nulls":3},"","",null,null,0,null,"",{"$nulls":3},"","",null,null,0]
[null,"",{"$nulls":3},"","",null,null,0,null,"",{"$nulls":3},"","",null,null,0]
[null,"",{"$nulls":3},"","",null,null,0,null,"",{"$nulls":3},"","",null,null,0]
[null,"",{"$nulls":3},"","",null,null,0,null,"",{"$nulls":3},"","",null,null,0]
[null,"",{"$nulls":3},"","",null,null,0,null,"",{"$nulls":3},"","",null,null,0]
[null,"",{"$nulls":3},"","",null,null,0,null,"",{"$nulls":3},"","",null,null,0]
[null,"",{"$nulls":3},"","",null,null,0,null,"",{"$nulls":3},"","",null,null,0]
[null,"",{"$nulls":3},"","",null,null,0,null,"",{"$nulls":3},"","",null,null,0]
[null,"",{"$nulls":3},"","",null,null,0,null,"",{"$nulls":3},"","",null,null,0]
[null,"",{"$nulls":3},"","",null,null,0,null,"",{"$nulls":3},"","",null,null,0]
[null,"",{"$nulls":3},"","",null,null,0,null,"",{"$nulls":3},"","",null,null,0]
[null,"",{"$nulls":3},"","",null,null,0,null,"",{"$nulls":3},"","",null,null,{"$f":"IF(R46<>\"\",P46,0)","v":0}]
[null,"",{"$nulls":3},"","",null,null,0,null,"",{"$nulls":3},"","",null,null,{"$f":"IF(R47<>\"\",P47,0)","v":0}]
[]
["Misc Items"]
["Description",{"$nulls":4},"Weight","Cost","In Pack","Quantity",null,"Description",{"$nulls":4},"Weight","Cost","In Pack","Quantity"]
[{"$nulls":9},0,{"$nulls":9},{"$f":"IF(R49<>\"\",P49,0)","v":0}]
[{"$nulls":9},0,{"$nulls":9},{"$f":"IF(R50<>\"\",P50,0)","v":0}]
[{"$nulls":9},0,{"$nulls":9},{"$f":"IF(R51<>\"\",P51,0)","v":0}]
[{"$nulls":9},0,{"$nulls":9},{"$f":"IF(R52<>\"\",P52,0)","v":0}]
[{"$nulls":9},0,{"$nulls":9},{"$f":"IF(R53<>\"\",P53,0)","v":0}]
[]
[]
["NOTES:"]

{"sheet":"Character Stats","index":2,"n_rows":89,"n_cols":42,"rows_kept":89,"merged":[[0,1,0,4],[1,1,1,4],[1,11,1,12],[1,13,1,14],[20,4,20,5],[20,12,20,13],[29,11,29,12],[30,11,30,12],[31,11,31,12],[32,11,32,12],[33,11,33,12],[34,11,34,12],[35,11,35,12],[36,11,36,12],[37,11,37,12],[39,10,39,12],[40,10,40,12]]}
["Character Name:","TBA",{"$nulls":7},"Gen'd?",null,0,"Change this value from zero when character is generated"]
["Player Name:","4.2 Beta",{"$nulls":7},"Date",null,{"$f":"IF(L1<>0,L2,N2)","v":"2015-08-19T15:38:35.760"},null,{"$f":"NOW()","v":42235.65180277778}]
[{"$f":"IF(A9=\"\",IF(C9=0,IF(K9=\"\",IF(K15=\"\",IF(A15=\"\",Z10,Z9),Z6),Z5),IF(C9>0,Z7,Z8)),Z4)","v":"Character attributes are correct."},null,"Base","Mods","Bonus","Score","Exp Cost",{"$nulls":5},"Base","Mods","Score"]
["Intelligence     (1-20)",{"$f":"IF(OR((E4>1),OR(C4>20,C4<1)),\"X\",\"\")","v":""},5,{"$f":"VLOOKUP(horoscope_stat,Horoscope,3)+VLOOKUP(race_stat,Race,3)","v":0},null,{"$f":"IF(E4>0,C4+D4+1,C4+D4)","v":5},{"$f":"IF(E4>0,500,0)","v":0},{"$nulls":3},"Speech",{"$f":"IF(OR(M4>20,M4<2),\"X\",\"\")","v":""},{"$f":"IF(L1<>0,M4,P4)","v":12},{"$f":"VLOOKUP(horoscope_stat,Horoscope,8)+VLOOKUP(race_stat,Race,8)","v":0},{"$f":"MAXA(IF(C4+10<M4+N4,C4+10,M4+N4),1)","v":12},{"$f":"TRUNC(RAND()*10+1)+TRUNC(RAND()*10+1)","v":12},{"$nulls":9},"A Selected Attribute is out of range."]
[{"$f":"\"Wisdom           (1-\"&TEXT(MIN(C4+10,20),0)&\")\"","v":"Wisdom           (1-15)"},{"$f":"IF(OR((E5>1),OR(C5>MIN(C4+10,20),C5<1)),\"X\",\"\")","v":""},15,{"$f":"IF(OR(LEFT(N10,1)=\"f\",LEFT(N10,1)=\"F\"),1,0)+VLOOKUP(horoscope_stat,Horoscope,4)+VLOOKUP(race_stat,Race,4)-IF(C4+10<C5,C5-H5)","v":0},null,{"$f":"IF(E5>0,C5+D5+1,C5+D5)","v":15},{"$f":"IF(E5>0,500,0)","v":0},{"$f":"MIN(C4+10,20)","v":15},null,null,"Appearance",{"$f":"IF(OR(M5>20,M5<2),\"X\",\"\")","v":""},{"$f":"IF(L1<>0,M5,P5)","v":11},{"$f":"VLOOKUP(horoscope_stat,Horoscope,9)+VLOOKUP(race_stat,Race,9)","v":0},{"$f":"MAXA(M5+N5,1)","v":11},{"$f":"TRUNC(RAND()*10+1)+TRUNC(RAND()*10+1)","v":11},{"$nulls":9},"A Random Attribute exceeds its allowed range."]
["Constitution     (1-20)",{"$f":"IF(OR((E6>1),OR(C6>20,C6<1)),\"X\",\"\")","v":""},5,{"$f":"VLOOKUP(horoscope_stat,Horoscope,5)+VLOOKUP(race_stat,Race,5)","v":0},null,{"$f":"IF(E6>0,C6+D6+1,C6+D6)","v":5},{"$f":"IF(E6>0,500,0)","v":0},{"$nulls":3},"Art",{"$f":"IF(OR(M6>20,M6<2),\"X\",\"\")","v":""},{"$f":"IF(L1<>0,M6,P6)","v":5},{"$f":"VLOOKUP(horoscope_stat,Horoscope,10)+VLOOKUP(race_stat,Race,10)","v":1},{"$f":"MAXA(IF((OR((C4+10<M6+N6),(C5+10<M6+N6))),MINA(C4,C5)+10,M6+N6),1)","v":6},{"$f":"TRUNC(RAND()*10+1)+TRUNC(RAND()*10+1)","v":5},{"$nulls":9},"Race, Size and/or Horoscope values exceed allowed ranges."]
[{"$f":"\"Strength          (1-\"&TEXT(MIN(C6+10,20),0)&\")\"","v":"Strength          (1-15)"},{"$f":"IF(OR((E7>1),OR(C7>MIN(C6+10,20),C7<1)),\"X\",\"\")","v":""},15,{"$f":"IF(OR(LEFT(N10,1)=\"f\",LEFT(N10,1)=\"F\"),-2,0)+VLOOKUP(horoscope_stat,Horoscope,6)+VLOOKUP(race_stat,Race,6)-IF(C6+10<C7,C7-H7)","v":1},null,{"$f":"IF(E7>0,C7+D7+1,C7+D7)","v":16},{"$f":"IF(E7>0,500,0)","v":0},{"$f":"MIN(C6+10,20)","v":15},null,{"$f":"ROUNDUP(IF(strength<4,-1,IF(strength>20,((strength-20)/2+1),(IF(strength>18,1,0)))),0)","v":0},"Ethics",{"$f":"IF(OR(M7>10,M7<1),\"X\",\"\")","v":""},{"$f":"IF(L1<>0,M7,P7)","v":2},{"$f":"VLOOKUP(horoscope_stat,Horoscope,11)+VLOOKUP(race_stat,Race,11)","v":0},{"$f":"MAXA(M7+N7,1)","v":2},{"$f":"TRUNC(RAND()*10)+1","v":2},{"$nulls":9},"Selected Attributes total greater than 60 points."]
["Dexterity          (1-20)",{"$f":"IF(OR((E8>1),OR(C8>20,C8<1)),\"X\",\"\")","v":""},20,{"$f":"IF(OR(LEFT(N10,1)=\"f\",LEFT(N10,1)=\"F\"),1,0)+VLOOKUP(horoscope_stat,Horoscope,7)+VLOOKUP(race_stat,Race,7)","v":2},null,{"$f":"IF(E8>0,C8+D8+1,C8+D8)","v":22},{"$f":"IF(E8>0,500,0)","v":0},{"$nulls":3},"Faith",{"$f":"IF(OR(M8>10,M8<1),\"X\",\"\")","v":""},{"$f":"IF(L1<>0,M8,P8)","v":8},{"$f":"VLOOKUP(horoscope_stat,Horoscope,12)+VLOOKUP(race_stat,Race,12)","v":0},{"$f":"MAXA(M8+N8,1)","v":8},{"$f":"TRUNC(RAND()*10)+1","v":8},{"$nulls":9},"Selected Attributes total less than 60 points."]
[{"$f":"IF(OR(OR(OR(OR(B4=\"X\",B5=\"X\"),B6=\"X\"),B7=\"X\"),B8=\"X\"),\"INVALID\",\"\")","v":""},null,{"$f":"SUM(C4:C8)-60","v":0},{"$f":"HLOOKUP(size1,Build,IF(OR(LEFT(N10,1)=\"f\",LEFT(N10,1)=\"F\"),2,1)+1)","v":2},null,{"$f":"HLOOKUP(size2,Stature,2*(VLOOKUP(race_stat,Race,17)))","v":68},{"$nulls":4},{"$f":"IF(OR(OR(OR(OR(L4=\"X\",L5=\"X\"),L6=\"X\"),L7=\"X\"),L8=\"X\"),\"INVALID\",\"\")","v":""},{"$nulls":14},"Body or Stamia exceeds allowed range"]
["Charisma",{"$nulls":4},{"$f":"ROUND((intelligence+wisdom+constitution+speech+appearance)/5,0)+E10","v":10},{"$f":"IF(E10>0,(VLOOKUP(F10-1,attrib_cost_table,2)-VLOOKUP(F10-E10-1,attrib_cost_table,2)),0)","v":0},{"$nulls":3},"Gender",null,{"$f":"IF(L1<>0,M10,P10)","v":34},{"$f":"IF(gender_stat<61,\"Male\",\"Female\")","v":"Male"},null,{"$f":"TRUNC(RAND()*100)+1","v":34},{"$nulls":9},"Character attributes are correct."]
["Charm",{"$nulls":4},{"$f":"ROUND((intelligence+appearance+art+speech+dexterity)/5,0)+E11","v":11},{"$f":"IF(E11>0,(VLOOKUP(F11-1,attrib_cost_table,2)-VLOOKUP(F11-E11-1,attrib_cost_table,2)),0)","v":0},{"$nulls":3},"Race",{"$f":"IF(OR(M11>20,M11<2),\"X\",\"\")","v":""},{"$f":"IF(L1<>0,IF(L1=2,O11,M11),P11)","v":10},{"$f":"VLOOKUP(race_stat,Race,2)","v":"Human"},null,{"$f":"TRUNC(RAND()*10+1)+TRUNC(RAND()*10+1)","v":10}]
["Stamina",{"$f":"IF(stamina>stamina_max,\"X\",\"\")","v":""},{"$f":"2*constitution","v":{"v":10,"d":"(10)"}},null,null,{"$f":"ROUND((constitution/4)+(faith/3),0)+E12","v":4},{"$f":"IF(E12>0,(VLOOKUP(F12-1,stamina_cost_table,2)-VLOOKUP(F12-E12-1,stamina_cost_table,2)),0)","v":0},{"$nulls":3},"Size",{"$f":"IF(OR(OR(OR(M12>10,M12<1),N12>20),N12<2),\"X\",\"\")","v":""},{"$f":"IF(L1<>0,M12,O12)","v":10},{"$f":"IF(L1<>0,N12,P12)","v":13},{"$f":"TRUNC(RAND()*10)+1","v":10},{"$f":"TRUNC(RAND()*10+1)+TRUNC(RAND()*10+1)","v":13},{"$nulls":8},"Primary Attribute Cost Table",{"$nulls":3},"Secondary Attribute Cost Table",{"$nulls":3},"Body Attribute Cost Table",{"$nulls":3},"Stamina Attribute Cost Table",{"$nulls":3},"Professional Skill Cost Table"]
["Body",{"$f":"IF(body>body_max,\"X\",\"\")","v":""},{"$f":"(constitution+strength)*2","v":{"v":42,"d":"(42)"}},null,null,{"$f":"ROUND((intelligence/8)+(strength/3)+(constitution/3),0)+VLOOKUP(race_stat,Race,14)+HLOOKUP(size2+size_mod,Stature,42)+E13","v":11},{"$f":"IF(E13>0,(VLOOKUP(F13-1,body_cost_table,2)-VLOOKUP(F13-E13-1,body_cost_table,2)),0)","v":0},{"$nulls":3},"Horoscope",{"$f":"IF(OR(M13<1,M13>100),\"X\",\"\")","v":""},{"$f":"IF(L1<>0,M13,P13)","v":90},{"$f":"LEFT(VLOOKUP(horoscope_stat,Horoscope,2),9)","v":"Pisces"},null,{"$f":"TRUNC(RAND()*100)+1","v":90},{"$nulls":8},"Cost","Level","Exp Cost",null,"Cost","Level","Exp Cost",null,"Cost","Level","Exp Cost",null,"Cost","Level","Exp Cost",null,"Skill Level","Exp Cost"]
["Vigor",{"$nulls":4},{"$f":"ROUND(carryingcap/200+dexterity/10+constitution/10,0)","v":4},{"$nulls":4},"Social Status",null,{"$f":"IF(L1<>0,M14,P14)","v":12},null,null,{"$f":"TRUNC(RAND()*10+1)+TRUNC(RAND()*10+1)","v":12},{"$nulls":8},75,1,0,null,10,1,0,null,15,1,0,null,15,{"v":1,"d":"1.00"},{"v":0,"d":"0.00"},null,0,-500]
[{"$f":"IF(OR(B12=\"X\",B13=\"X\"),\"INVALID\",\"\")","v":""},{"$nulls":9},{"$f":"IF(OR(OR(OR(OR(L11=\"X\",L11=\"X\"),L12=\"X\"),L13=\"X\"),L14=\"X\"),\"INVALID\",\"\")","v":""},{"$nulls":14},{"$f":"Z14+1","v":2},{"$f":"(Z15*attrib_cost)+AA14","v":150},null,null,{"$f":"AD14+1","v":2},{"$f":"(AD15*secondary_attrib_cost)+AE14","v":20},null,null,{"$f":"AH14+1","v":2},{"$f":"(AH15*body_cost)+AI14","v":30},null,null,{"$f":"AL14+1","v":{"v":2,"d":"2.00"}},{"$f":"(AL15*stamina_cost)+AM14","v":{"v":30,"d":"30.00"}},null,1,0]
["Stealth",{"$nulls":4},{"$f":"ROUND((strength+(dexterity*2)+intelligence)/4,0)+E16+(IF(skill_cluster>4,IF(skill_cluster<8,2,0),0))","v":16},{"$f":"IF(E16>0,(VLOOKUP(F16-1,secondary_attrib_cost_table,2)-VLOOKUP(F16-E16-1,secondary_attrib_cost_table,2)),0)","v":0},{"$nulls":3},"Height",null,{"$f":"TRUNC(height_in_inches/12)","v":{"v":5,"d":"5'"}},{"$f":"MOD(height_in_inches,12)","v":8},{"$nulls":11},{"$f":"Z15+1","v":3},{"$f":"(Z16*attrib_cost)+AA15","v":375},null,null,{"$f":"AD15+1","v":3},{"$f":"(AD16*secondary_attrib_cost)+AE15","v":50},null,null,{"$f":"AH15+1","v":3},{"$f":"(AH16*body_cost)+AI15","v":75},null,null,{"$f":"AL15+1","v":{"v":3,"d":"3.00"}},{"$f":"(AL16*stamina_cost)+AM15","v":{"v":75,"d":"75.00"}},null,2,100]
["Combat",{"$nulls":4},{"$f":"ROUND((constitution+(strength*2)+(dexterity*2))/5,0)+E17","v":16},{"$f":"IF(E17>0,(VLOOKUP(F17-1,secondary_attrib_cost_table,2)-VLOOKUP(F17-E17-1,secondary_attrib_cost_table,2)),0)","v":0},{"$nulls":3},"Weight",null,null,{"$f":"HLOOKUP(size2+size_mod,Stature,2*(VLOOKUP(race_stat,Race,17))+1)","v":190},"lb",{"$nulls":10},4,{"$f":"(Z17*attrib_cost)+AA16","v":675},null,null,4,90,null,null,4,135,null,null,{"v":4,"d":"4.00"},{"v":135,"d":"135.00"},null,3,300]
["Magic",null,null,{"$f":"VLOOKUP(race_stat,Race,13)","v":0},null,{"$f":"ROUND((intelligence+charm-ethics+5)/2,0)+D18+E18","v":10},{"$f":"IF(E18>0,(VLOOKUP(F18-1,secondary_attrib_cost_table,2)-VLOOKUP(F18-E18-1,secondary_attrib_cost_table,2)),0)","v":0},{"$nulls":3},"Carrying Cap.",null,null,{"$f":"ROUND((strength/10+constitution/100)*weight,0)","v":314},"lb",{"$nulls":10},5,1050,null,null,5,140,null,null,5,210,null,null,{"v":5,"d":"5.00"},{"v":210,"d":"210.00"},null,4,600]
["Miracle",{"$nulls":4},{"$f":"ROUND((wisdom+charisma+faith-5)/2,0)+E19","v":14},{"$f":"IF(E19>0,(VLOOKUP(F19-1,secondary_attrib_cost_table,2)-VLOOKUP(F19-E19-1,secondary_attrib_cost_table,2)),0)","v":0},{"$nulls":3},"Age",null,null,{"$f":"VLOOKUP(race_stat,Race,15)+VLOOKUP(skill_cluster,Age,2)","v":29},"yr",{"$nulls":10},6,1500,null,null,6,200,null,null,6,300,null,null,{"v":6,"d":"6.00"},{"v":300,"d":"300.00"},null,5,1000]
[{"$nulls":25},7,2025,null,null,7,270,null,null,7,405,null,null,{"v":7,"d":"7.00"},{"v":405,"d":"405.00"},null,6,1500]
["Skill Cluster",null,{"$f":"VLOOKUP($E$21,skill_cluster_code,2)","v":4},null,"Knight",{"$nulls":5},"Money",null,{"$f":"INT((social_status*charisma*charm)/2)","v":660},{"$nulls":12},8,2625,null,null,8,350,null,null,8,525,null,null,{"v":8,"d":"8.00"},{"v":525,"d":"525.00"},null,7,2100]
[{"$nulls":25},9,3300,null,null,9,440,null,null,9,660,null,null,{"v":9,"d":"9.00"},{"v":660,"d":"660.00"},null,8,2800]
["Skills","Skill Type","Initial","Skill Number","Mods","Level","Exp Cost",{"$nulls":3},"Experience",null,null,"Spell Affinity",{"$nulls":11},10,4050,null,null,10,540,null,null,10,810,null,null,{"v":10,"d":"10.00"},{"v":810,"d":"810.00"},null,9,3600]
[{"$f":"VLOOKUP(skill_cluster,Skills,3)","v":"Two Edge Blades"},{"$f":"IF(A24>\" \",VLOOKUP(A24,skill_by_name_table,5,FALSE),\"\")","v":"S"},{"$f":"IF(skill1>\" \",VLOOKUP(skill_cluster,Skills,4),\"\")","v":2},{"$f":"IF(B24>\"\",VLOOKUP(A24,skill_by_name_table,4,FALSE),0)","v":23},null,{"$f":"IF(C24=\"\",\"\",IF(C24=0,IF(E24>0,E24+N24,\"\"),C24+E24+N24))","v":2},{"$f":"IF(F24<>\"\",(VLOOKUP(F24-N24,skill_cost_table,2)-VLOOKUP(C24,skill_cost_table,2)+IF(C24=0,IF(F24>1,100,0),0)),\"\")","v":0},null,null,1,"Exp Start",null,{"$f":"TRUNC(VLOOKUP(SUM(C4:D4),Sbonus,2)+VLOOKUP(SUM(C5:D5),Sbonus,3))+500","v":675},{"$f":"IF(D24>125,IF(VLOOKUP(D24,Spell_Skills_by_number,7)=skill_cluster,VLOOKUP(D24,Spell_Skills_by_number,8),0)+IF(VLOOKUP(D24,Spell_Skills_by_number,9)=skill_cluster,VLOOKUP(D24,Spell_Skills_by_number,10),0)+IF(VLOOKUP(D24,Spell_Skills_by_number,11)=skill_cluster,VLOOKUP(D24,Spell_Skills_by_number,12),0),0)","v":0},{"$nulls":11},{"$f":"Z23+1","v":11},{"$f":"(Z24*attrib_cost)+AA23","v":4875},null,null,{"$f":"AD23+1","v":11},{"$f":"(AD24*secondary_attrib_cost)+AE23","v":650},null,null,{"$f":"AH23+1","v":11},{"$f":"(AH24*body_cost)+AI23","v":975},null,null,{"$f":"AL23+1","v":{"v":11,"d":"11.00"}},{"$f":"(AL24*stamina_cost)+AM23","v":{"v":975,"d":"975.00"}},null,10,4500]
[{"$f":"VLOOKUP(skill_cluster,Skills,5)","v":"Mounted Lance"},{"$f":"IF(A25>\" \",VLOOKUP(A25,skill_by_name_table,5,FALSE),\"\")","v":"S"},{"$f":"IF(skill2>\" \",VLOOKUP(skill_cluster,Skills,6),\"\")","v":1},{"$f":"IF(B25>\"\",VLOOKUP(A25,skill_by_name_table,4,FALSE),0)","v":16},null,{"$f":"IF(C25=\"\",\"\",IF(C25=0,IF(E25>0,E25+N25,\"\"),C25+E25+N25))","v":1},0,null,null,{"$f":"J24+1","v":2},"Exp Gained",null,null,0,{"$nulls":11},12,5775,null,null,12,770,null,null,12,1155,null,null,{"v":12,"d":"12.00"},{"v":1155,"d":"1155.00"},null,11,5500]
[{"$f":"VLOOKUP(skill_cluster,Skills,7)","v":"Single Edge Blades"},"S",{"$f":"IF(skill3>\" \",VLOOKUP(skill_cluster,Skills,8),\"\")","v":1},20,null,1,0,null,null,{"$f":"J25+1","v":3},"Exp Used",null,{"$f":"SUM(G3:G53)","v":0},0,{"$nulls":11},13,6750,null,null,13,900,null,null,13,1350,null,null,{"v":13,"d":"13.00"},{"v":1350,"d":"1350.00"},null,12,6600]
[{"$f":"VLOOKUP(skill_cluster,Skills,9)","v":"Shields"},"S",{"$f":"IF(skill4>\" \",VLOOKUP(skill_cluster,Skills,10),\"\")","v":2},19,null,2,0,null,null,4,"Exp UnUsed",null,{"$f":"SUM(M24:M25)-exp_used","v":675},0,{"$nulls":11},14,7800,null,null,14,1040,null,null,14,1560,null,null,{"v":14,"d":"14.00"},{"v":1560,"d":"1560.00"},null,13,7800]
[{"$f":"VLOOKUP(skill_cluster,Skills,11)","v":"Dodge"},"S",{"$f":"IF(skill5>\" \",VLOOKUP(skill_cluster,Skills,12),\"\")","v":1},32,null,1,0,null,null,5,{"$nulls":3},0,{"$nulls":11},15,8925,null,null,15,1190,null,null,15,1785,null,null,{"v":15,"d":"15.00"},{"v":1785,"d":"1785.00"},null,14,9100]
[{"$f":"VLOOKUP(skill_cluster,Skills,13)","v":"Tackle"},"S",{"$f":"IF(skill6>\" \",VLOOKUP(skill_cluster,Skills,14),\"\")","v":1},35,null,1,0,null,null,6,"General Information",null,null,0,{"$nulls":11},16,10125,null,null,16,1350,null,null,16,2025,null,null,{"v":16,"d":"16.00"},{"v":2025,"d":"2025.00"},null,15,10500]
[{"$f":"VLOOKUP(skill_cluster,Skills,15)","v":"Grapple"},"S",{"$f":"IF(skill7>\" \",VLOOKUP(skill_cluster,Skills,16),\"\")","v":1},34,null,1,{"$f":"IF(F30<>\"\",(VLOOKUP(F30-N30,skill_cost_table,2)-VLOOKUP(C30,skill_cost_table,2)+IF(C30=0,IF(F30>1,100,0),0)),\"\")","v":0},null,null,7,"Hometown",null,null,0,{"$nulls":11},17,11400,null,null,17,1520,null,null,17,2280,null,null,{"v":17,"d":"17.00"},{"v":2280,"d":"2280.00"}]
[{"$f":"VLOOKUP(skill_cluster,Skills,17)","v":"Protection from Evil (M)"},"C",{"$f":"IF(skill8>\" \",VLOOKUP(skill_cluster,Skills,18),\"\")","v":1},228,null,1,{"$f":"IF(F31<>\"\",(VLOOKUP(F31-N31,skill_cost_table,2)-VLOOKUP(C31,skill_cost_table,2)+IF(C31=0,IF(F31>1,100,0),0)),\"\")","v":0},null,null,8,"Religion",null,null,0,{"$nulls":11},18,12750,null,null,18,1700,null,null,18,2550,null,null,{"v":18,"d":"18.00"},{"v":2550,"d":"2550.00"}]
[{"$f":"VLOOKUP(skill_cluster,Skills,19)","v":"Protection from Magic (M)"},"C",{"$f":"IF(skill9>\" \",VLOOKUP(skill_cluster,Skills,20),\"\")","v":1},229,null,1,0,null,null,9,"Affiliation",null,null,0,{"$nulls":11},19,14175,null,null,19,1890,null,null,19,2835,null,null,{"v":19,"d":"19.00"},{"v":2835,"d":"2835.00"}]
[{"$f":"VLOOKUP(skill_cluster,Skills,21)","v":"Ritual Method"},"M",{"$f":"IF(skill10>\" \",VLOOKUP(skill_cluster,Skills,22),\"\")","v":1},8,null,1,0,null,null,10,"Guild(s)",null,null,0,{"$nulls":11},20,15675,null,null,20,2090,null,null,20,3135,null,null,{"v":20,"d":"20.00"},{"v":3135,"d":"3135.00"}]
[{"$f":"VLOOKUP(skill_cluster,Skills,23)","v":"Chirurgery"},"S",{"$f":"IF(skill11>\" \",VLOOKUP(skill_cluster,Skills,24),\"\")","v":1},58,null,1,0,null,null,11,"Vision",{"$f":"VLOOKUP(race_stat,Race,18)","v":"Normal"},null,0,{"$nulls":11},21,17250,null,null,21,2300,null,null,21,3450,null,null,{"v":21,"d":"21.00"},{"v":3450,"d":"3450.00"}]
[{"$f":"VLOOKUP(skill_cluster,Skills,25)","v":"Military Engineer"},"S",{"$f":"IF(skill12>\" \",VLOOKUP(skill_cluster,Skills,26),\"\")","v":1},65,null,1,0,null,null,12,"Handedness",null,null,0,{"$nulls":11},22,18900,null,null,22,2520,null,null,22,3780,null,null,{"v":22,"d":"22.00"},{"v":3780,"d":"3780.00"}]
[{"$f":"VLOOKUP(skill_cluster,Skills,27)","v":"Service"},"S",{"$f":"IF(skill13>\" \",VLOOKUP(skill_cluster,Skills,28),\"\")","v":1},125,null,1,0,null,null,13,"Complexion",null,null,0,{"$nulls":11},23,20625,null,null,23,2750,null,null,23,4125,null,null,{"v":23,"d":"23.00"},{"v":4125,"d":"4125.00"}]
[{"$f":"VLOOKUP(skill_cluster,Skills,29)","v":"Armory"},"S",{"$f":"IF(skill14>\" \",VLOOKUP(skill_cluster,Skills,30),\"\")","v":1},69,null,1,0,null,null,14,"Eye Color",null,null,0,{"$nulls":11},24,22425,null,null,24,2990,null,null,24,4485,null,null,{"v":24,"d":"24.00"},{"v":4485,"d":"4485.00"}]
[{"$f":"VLOOKUP(skill_cluster,Skills,31)","v":"Riding"},"S",{"$f":"IF(skill15>\" \",VLOOKUP(skill_cluster,Skills,32),\"\")","v":1},91,null,1,0,null,null,15,"Hair Color",null,null,0,{"$nulls":11},25,24300,null,null,25,3240,null,null,25,4860,null,null,{"v":25,"d":"25.00"},{"v":4860,"d":"4860.00"}]
[{"$f":"VLOOKUP(skill_cluster,Skills,33)","v":"Finance"},"S",{"$f":"IF(skill16>\" \",VLOOKUP(skill_cluster,Skills,34),\"\")","v":1},59,null,1,0,null,null,16,"Identifying Marks",null,null,0,{"$nulls":11},26,26250,null,null,26,3500,null,null,26,5250,null,null,{"v":26,"d":"26.00"},{"v":5250,"d":"5250.00"}]
[{"$f":"VLOOKUP(skill_cluster,Skills,35)","v":"Falconry"},"S",{"$f":"IF(skill17>\" \",VLOOKUP(skill_cluster,Skills,36),\"\")","v":1},77,null,1,0,null,null,17,{"$nulls":3},0,{"$nulls":11},27,28275,null,null,27,3770,null,null,27,5655,null,null,{"v":27,"d":"27.00"},{"v":5655,"d":"5655.00"}]
[{"$f":"VLOOKUP(skill_cluster,Skills,37)","v":" "},"",{"$f":"IF(skill18>\" \",VLOOKUP(skill_cluster,Skills,38),\"\")","v":""},0,null,"","",null,null,18,{"$nulls":3},0,{"$nulls":11},28,30375,null,null,28,4050,null,null,28,6075,null,null,{"v":28,"d":"28.00"},{"v":6075,"d":"6075.00"}]
[{"$f":"VLOOKUP(skill_cluster,Skills,39)","v":" "},"",{"$f":"IF(skill19>\" \",VLOOKUP(skill_cluster,Skills,40),\"\")","v":""},0,null,"","",null,null,19,{"$nulls":3},0,{"$nulls":11},29,32550,null,null,29,4340,null,null,29,6510,null,null,{"v":29,"d":"29.00"},{"v":6510,"d":"6510.00"}]
[{"$f":"VLOOKUP(skill_cluster,Skills,41)","v":" "},"",{"$f":"IF(skill20>\" \",VLOOKUP(skill_cluster,Skills,42),\"\")","v":""},0,null,"","",null,null,20,{"$nulls":3},0,{"$nulls":11},30,34800,null,null,30,4640,null,null,30,6960,null,null,{"v":30,"d":"30.00"},{"v":6960,"d":"6960.00"}]
[null,"",{"$f":"IF(A44>\" \",VLOOKUP(skill_cluster,Skills,42),\"\")","v":""},0,null,"","",null,null,21,{"$nulls":3},0,{"$nulls":11},31,37125,null,null,31,4950,null,null,31,7425,null,null,{"v":31,"d":"31.00"},{"v":7425,"d":"7425.00"}]
[null,"",{"$f":"IF(A45>\" \",VLOOKUP(skill_cluster,Skills,42),\"\")","v":""},0,null,"","",null,null,22,{"$nulls":3},0,{"$nulls":11},32,39525,null,null,32,5270,null,null,32,7905,null,null,{"v":32,"d":"32.00"},{"v":7905,"d":"7905.00"}]
[null,"","",0,null,"","",null,null,23,{"$nulls":3},0,{"$nulls":11},33,42000,null,null,33,5600,null,null,33,8400,null,null,{"v":33,"d":"33.00"},{"v":8400,"d":"8400.00"}]
[null,"","",0,null,"","",null,null,24,{"$nulls":3},0,{"$nulls":11},34,44550,null,null,34,5940,null,null,34,8910,null,null,{"v":34,"d":"34.00"},{"v":8910,"d":"8910.00"}]
[null,"","",0,null,"","",null,null,25,{"$nulls":3},0,{"$nulls":11},35,47175,null,null,35,6290,null,null,35,9435,null,null,{"v":35,"d":"35.00"},{"v":9435,"d":"9435.00"}]
[null,"","",0,null,"","",null,null,26,{"$nulls":3},0,{"$nulls":11},{"$f":"Z42+1","v":30},49425,null,null,{"$f":"AD42+1","v":30},6590,null,null,{"$f":"AH42+1","v":30},9885,null,null,{"$f":"AL42+1","v":{"v":30,"d":"30.00"}},{"v":9885,"d":"9885.00"}]
[null,"","",0,null,"","",null,null,27,{"$nulls":3},0,{"$nulls":11},31,51750,null,null,{"$f":"AD49+1","v":31},6900,null,null,{"$f":"AH49+1","v":31},10350,null,null,{"$f":"AL49+1","v":{"v":31,"d":"31.00"}},{"v":10350,"d":"10350.00"}]
[null,"","",0,null,"","",null,null,28,{"$nulls":3},0,{"$nulls":11},32,54150,null,null,32,7220,null,null,32,10830,null,null,{"v":32,"d":"32.00"},{"v":10830,"d":"10830.00"}]
[null,"","",0,null,"","",null,null,29,{"$nulls":3},0,{"$nulls":11},33,56625,null,null,33,7550,null,null,33,11325,null,null,{"v":33,"d":"33.00"},{"v":11325,"d":"11325.00"}]
[null,"","",0,null,"","",null,null,30,{"$nulls":3},0,{"$nulls":11},34,59175,null,null,34,7890,null,null,34,11835,null,null,{"v":34,"d":"34.00"},{"v":11835,"d":"11835.00"}]
[{"$nulls":25},{"$f":"Z53+1","v":35},{"$f":"(Z54*attrib_cost)+AA53","v":61800},null,null,{"$f":"AD53+1","v":35},{"$f":"(AD54*secondary_attrib_cost)+AE53","v":8240},null,null,{"$f":"AH53+1","v":35},{"$f":"(AH54*body_cost)+AI53","v":12360},null,null,{"$f":"AL53+1","v":{"v":35,"d":"35.00"}},{"$f":"(AL54*stamina_cost)+AM53","v":{"v":12360,"d":"12360.00"}}]
[{"$nulls":25},36,64500,null,null,36,8600,null,null,36,12900,null,null,{"v":36,"d":"36.00"},{"v":12900,"d":"12900.00"}]
[{"$nulls":25},37,67275,null,null,37,8970,null,null,37,13455,null,null,{"v":37,"d":"37.00"},{"v":13455,"d":"13455.00"}]
[{"$nulls":25},38,70125,null,null,38,9350,null,null,38,14025,null,null,{"v":38,"d":"38.00"},{"v":14025,"d":"14025.00"}]
[{"$nulls":25},39,73050,null,null,39,9740,null,null,39,14610,null,null,{"v":39,"d":"39.00"},{"v":14610,"d":"14610.00"}]
[{"$nulls":25},40,76050,null,null,40,10140,null,null,40,15210,null,null,{"v":40,"d":"40.00"},{"v":15210,"d":"15210.00"}]
[{"$nulls":25},41,79125,null,null,41,10550,null,null,41,15825,null,null,{"v":41,"d":"41.00"},{"v":15825,"d":"15825.00"}]
[{"$nulls":25},42,82275,null,null,42,10970,null,null,42,16455,null,null,{"v":42,"d":"42.00"},{"v":16455,"d":"16455.00"}]
[{"$nulls":25},43,85500,null,null,43,11400,null,null,43,17100,null,null,{"v":43,"d":"43.00"},{"v":17100,"d":"17100.00"}]
[{"$nulls":25},44,88800,null,null,44,11840,null,null,44,17760,null,null,{"v":44,"d":"44.00"},{"v":17760,"d":"17760.00"}]
[{"$nulls":25},45,92175,null,null,45,12290,null,null,45,18435,null,null,{"v":45,"d":"45.00"},{"v":18435,"d":"18435.00"}]
[{"$nulls":25},46,95625,null,null,46,12750,null,null,46,19125,null,null,{"v":46,"d":"46.00"},{"v":19125,"d":"19125.00"}]
[{"$nulls":25},47,99150,null,null,47,13220,null,null,47,19830,null,null,{"v":47,"d":"47.00"},{"v":19830,"d":"19830.00"}]
[{"$nulls":25},48,102750,null,null,48,13700,null,null,48,20550,null,null,{"v":48,"d":"48.00"},{"v":20550,"d":"20550.00"}]
[{"$nulls":25},49,106425,null,null,49,14190,null,null,49,21285,null,null,{"v":49,"d":"49.00"},{"v":21285,"d":"21285.00"}]
[{"$nulls":25},50,110175,null,null,50,14690,null,null,50,22035,null,null,{"v":50,"d":"50.00"},{"v":22035,"d":"22035.00"}]
[{"$nulls":25},51,114000,null,null,51,15200,null,null,51,22800,null,null,{"v":51,"d":"51.00"},{"v":22800,"d":"22800.00"}]
[{"$nulls":25},52,117900,null,null,52,15720,null,null,52,23580,null,null,{"v":52,"d":"52.00"},{"v":23580,"d":"23580.00"}]
[{"$nulls":25},53,121875,null,null,53,16250,null,null,53,24375,null,null,{"v":53,"d":"53.00"},{"v":24375,"d":"24375.00"}]
[{"$nulls":25},54,125925,null,null,54,16790,null,null,54,25185,null,null,{"v":54,"d":"54.00"},{"v":25185,"d":"25185.00"}]
[{"$nulls":25},55,130050,null,null,55,17340,null,null,55,26010,null,null,{"v":55,"d":"55.00"},{"v":26010,"d":"26010.00"}]
[{"$nulls":25},56,134250,null,null,56,17900,null,null,56,26850,null,null,{"v":56,"d":"56.00"},{"v":26850,"d":"26850.00"}]
[{"$nulls":25},57,138525,null,null,57,18470,null,null,57,27705,null,null,{"v":57,"d":"57.00"},{"v":27705,"d":"27705.00"}]
[{"$nulls":25},58,142875,null,null,58,19050,null,null,58,28575,null,null,{"v":58,"d":"58.00"},{"v":28575,"d":"28575.00"}]
[{"$nulls":25},59,147300,null,null,59,19640,null,null,59,29460,null,null,{"v":59,"d":"59.00"},{"v":29460,"d":"29460.00"}]
[{"$nulls":25},60,151800,null,null,60,20240,null,null,60,30360,null,null,{"v":60,"d":"60.00"},{"v":30360,"d":"30360.00"}]
[{"$nulls":25},61,156375,null,null,61,{"$f":"(AD80*secondary_attrib_cost)+AE79","v":20850},null,null,61,{"$f":"(AH80*body_cost)+AI79","v":31275},null,null,{"v":61,"d":"61.00"},{"$f":"(AL80*stamina_cost)+AM79","v":{"v":31275,"d":"31275.00"}}]
[{"$nulls":25},{"$f":"Z80+1","v":62},{"$f":"(Z81*attrib_cost)+AA80","v":161025},null,null,62,21470,null,null,62,32205,null,null,{"v":62,"d":"62.00"},{"v":32205,"d":"32205.00"}]
[{"$nulls":25},63,165750,null,null,63,22100,null,null,63,33150,null,null,{"v":63,"d":"63.00"},{"v":33150,"d":"33150.00"}]
[{"$nulls":25},64,170550,null,null,64,22740,null,null,64,34110,null,null,{"v":64,"d":"64.00"},{"v":34110,"d":"34110.00"}]
[{"$nulls":25},65,175425,null,null,65,23390,null,null,65,35085,null,null,{"v":65,"d":"65.00"},{"v":35085,"d":"35085.00"}]
[{"$nulls":25},66,180375,null,null,66,24050,null,null,66,36075,null,null,{"v":66,"d":"66.00"},{"v":36075,"d":"36075.00"}]
[{"$nulls":25},67,185400,null,null,67,24720,null,null,67,37080,null,null,{"v":67,"d":"67.00"},{"v":37080,"d":"37080.00"}]
[{"$nulls":25},68,190500,null,null,68,25400,null,null,68,38100,null,null,{"v":68,"d":"68.00"},{"v":38100,"d":"38100.00"}]
[{"$nulls":25},69,195675,null,null,69,26090,null,null,69,39135,null,null,{"v":69,"d":"69.00"},{"v":39135,"d":"39135.00"}]
[{"$nulls":25},70,200925,null,null,70,26790,null,null,70,40185,null,null,{"v":70,"d":"70.00"},{"v":40185,"d":"40185.00"}]

{"sheet":"Equipment List","index":3,"n_rows":407,"n_cols":32,"rows_kept":407}
[null,"EQUIPMENT TABLE"]
["Item","Body Armour","Class","Cost","Weight","Dodge Mod",{"$nulls":20},"Body Armour","Item"]
[1,"None",0,0,0,-1,{"$nulls":20},"Banded",7]
[{"$f":"A3+1","v":2},"Leather",1,10,0.1,-1,{"$nulls":20},"Chain and Plate",12]
[{"$f":"A4+1","v":3},"Cuir-Boulli",2,45,0.15,0,{"$nulls":20},"Chain Mail",8]
[4,"Quilt",2,60,0.1,0,{"$nulls":20},"Cuirass",9]
[5,"Scale",3,50,0.2,0,{"$nulls":20},"Cuir-Boulli",3]
[6,"Splint",3,65,0.2,0,{"$nulls":20},"Leather",2]
[7,"Banded",4,80,0.25,0,{"$nulls":20},"Mail Armour",10]
[8,"Chain Mail",5,150,0.25,0,{"$nulls":20},"None",1]
[9,"Cuirass",6,200,0.3,0,{"$nulls":20},"Plate",13]
[10,"Mail Armour",7,550,0.4,0,{"$nulls":20},"Quilt",4]
[{"$f":"A12+1","v":11},"Superior Mail",8,750,0.45,0,{"$nulls":20},"Scale",5]
[{"$f":"A13+1","v":12},"Chain and Plate",9,1000,0.6,0,{"$nulls":20},"Splint",6]
[{"$f":"A14+1","v":13},"Plate",10,2000,0.75,1,{"$nulls":20},"Superior Mail",11]
[null,"Surcoats","Class","Cost","Weight","Dodge Mod",{"$nulls":20},"Surcoats","Item"]
[{"$f":"A15+1","v":14},"None",0,0,0,0,{"$nulls":20},"None",14]
[{"$f":"A17+1","v":15},"Quilt Surcoat","+1",70,0.1,0,{"$nulls":20},"Quilt Surcoat",15]
[{"$f":"A18+1","v":16},"Splint Surcoat","+2",75,0.25,0,{"$nulls":20},"Splint Surcoat",16]
[]
["Item","Head Armour","Class","Cost","Weight","Combat Mod",{"$nulls":20},"Head Armour","Item"]
[{"$f":"A19+1","v":17},"None",0,0,0,-10,{"$nulls":20},"Bascinet",22]
[{"$f":"A22+1","v":18},"Cuir-Boulli",2,15,2,0,{"$nulls":20},"Classical Helm",21]
[19,"Conical Helm",3,35,3,0,{"$nulls":20},"Conical Helm",19]
[20,"Norman Helm",4,40,4,0,{"$nulls":20},"Crusader's Helm",23]
[21,"Classical Helm",5,45,4,0,{"$nulls":20},"Cuir-Boulli",18]
[22,"Bascinet",6,55,5,0,{"$nulls":20},"None",17]
[23,"Crusader's Helm",7,90,9,-5,{"$nulls":20},"Norman Helm",20]
[24,"Visored Bascinet",8,150,10,-15,{"$nulls":20},"Visored Bascinet",24]
[null,"Coifs","Class","Cost","Weight","Combat Mod",{"$nulls":20},"Coifs","Item"]
[{"$f":"A29+1","v":25},"None",0,0,0,0,{"$nulls":20},"Chain Coif",27]
[{"$f":"A31+1","v":26},"Leather Hood",1,5,2,0,{"$nulls":20},"Leather Hood",26]
[{"$f":"A32+1","v":27},"Chain Coif",3,35,3,0,{"$nulls":20},"None",25]
[]
[null,"Weapons"]
["Item","Very Light Weapons","Class","Cost","Weight","Blows","Length",0,1,2,3,4,5,6,7,8,9,10,"Damage","Type","VL","L","M","H","P","Skill","Weapons","Item"]
[{"$f":"A33+1","v":28},"Dagger","VL",36,2,4,1.5,20,10,5,0,-5,-10,-15,-20,-20,-25,-30,"1d6","P",{"$nulls":5},"Knives","Bastard Sword",56,null,"Axes","Axes","Battle Axe"]
[{"$f":"A37+1","v":29},"Knife","VL",18,2,4,1.5,20,10,5,0,-5,-10,-15,-20,-20,-25,-30,"1d6","C",{"$nulls":5},"Knives","Battle Axe",53,null,"Cudgels","Axes","Norman War Axe"]
[{"$f":"A38+1","v":30},"Sickle","VL",35,2,4,1,20,10,5,0,-5,-10,-15,-20,-20,-25,-30,"1d3","C",{"$nulls":5},"Knives","Broadsword",57,null,"Flails","Axes","Woodsman's Axe"]
[31,"Foil","VL",150,2,4,3.5,55,40,25,15,5,0,-20,-15,-20,-25,-30,"1d8","P",{"$nulls":5},"Foil","Bullwhip",39,null,"Foil","Axes","Halberd"]
[32,"Hatchet","VL",15,2,3,3,20,15,5,0,-5,-10,-15,-20,-25,-30,-35,"1d12","B",{"$nulls":5},"Light Axes","Combat Lance",71,null,"Hammers","Axes","Two-Handed Battle Axe"]
[33,"Light Axe","VL",15,2,3,3,20,15,5,0,-5,-10,-15,-20,-25,-30,-35,"1d12","C",{"$nulls":5},"Light Axes","Conteux de Breche",79,null,"Knives","Cudgels","Light Club"]
[34,"Light Club","VL",1,3,3,3,20,15,5,0,-5,-10,-15,-20,-25,-30,-35,"1d10","B",{"$nulls":5},"Cudgels","Cudgel",41,null,"Light Axes","Cudgels","Cudgel"]
[35,"Light Sword","VL",100,5,3,5,35,30,25,15,10,5,-5,-15,-20,-25,-30,"2d6","C",{"$nulls":5},"Short Blades","Cutlass",43,null,"Mounted Lance","Cudgels","War Pick"]
[36,"Rapier","VL",100,5,3,4,50,40,30,20,10,5,0,-5,-15,-20,-25,"1d10","C",{"$nulls":5},"Short Blades","Dagger",28,null,"Polearms","Cudgels","Heavy Club"]
[37,"Short Sword","VL",65,5,3,3,30,25,20,10,0,-5,-10,-15,-15,-20,-25,"2d6","C",{"$nulls":5},"Short Blades","Dwarvish Warhammer",58,null,"Short Blades","Cudgels","Mace"]
[{"$nulls":26},"Fauchard",80,null,"Single Edge Blades","Flails","Flail"]
["Item","Light Weapons","Class","Cost","Weight","Blows","Length",0,1,2,3,4,5,6,7,8,9,10,"Damage","Type","VL","L","M","H","P","Skill","Fauchard Fork",81,null,"Spears","Flails","Morning Star"]
[{"$f":"A46+1","v":38},"Net","L",10,5,1,5,5,5,5,10,25,15,25,25,30,35,40,{"$nulls":7},"Throwing Weapons","Flail",67,null,"Staves","Flails","Two-Handed Flail"]
[{"$f":"A49+1","v":39},"Bullwhip","L",48,3,3,12,50,50,40,25,10,-5,-10,-15,-25,-30,-30,"2d6","B",{"$nulls":5},"Whips","Foil",31,null,"Throwing Weapons","Foil","Foil"]
[40,"Whipknife","L",32,4,3,8,50,50,40,25,10,-5,-10,-15,-20,-25,-30,"3d6","C",{"$nulls":5},"Whips","Footman's Lance",89,null,"Two Edge Blades","Hammers","Dwarvish Warhammer"]
[41,"Cudgel","L",5,12,3,3.5,20,15,5,0,-5,-10,-15,-20,-25,-30,-30,"2d6","B",{"$nulls":5},"Cudgels","Guisarme/Bill",82,null,"Whips","Hammers","Warhammer"]
[42,"Tomahawk","L",3,2,3,3.5,20,15,5,0,-5,-10,-15,-20,-25,-25,-30,"2d6","B",{"$nulls":5},"Light Axes","Halberd",68,null,null,"Hammers","Maul"]
[43,"Cutlass","L",100,7,3,4,35,30,20,15,10,5,0,-5,-10,-15,-15,"1d12","C",{"$nulls":5},"Single Edge Blades","Hand-and-a-half Sword",69,null,null,"Hammers","Two-Handed Warhammer"]
[44,"Saber","L",100,7,3,4,35,30,20,15,15,5,0,-5,-10,-15,-15,"1d12","C",{"$nulls":5},"Single Edge Blades","Hatchet",32,null,null,"Knives","Dagger"]
[45,"Javelin (thrust)","L",70,3.5,3,7,30,25,20,15,10,0,-5,-10,-10,-15,-15,"1d8","P",{"$nulls":5},"Spears","Heavy Club",59,null,null,"Knives","Knife"]
[46,"Longsword","L",100,10,3,7,30,25,20,15,10,5,-5,-5,-10,-15,-20,"2d6","C",{"$nulls":5},"Single Edge Blades","Hunting Spear",60,null,null,"Knives","Sickle"]
[47,"Normal Sword","L",100,7,3,5,35,25,20,15,10,0,-5,-10,-10,-15,-15,"2d6","C",{"$nulls":5},"Single Edge Blades","Ironshod Quarterstaff",65,null,null,"Light Axes","Hatchet"]
[48,"Pitchfork","L",3,2,3,6,20,15,10,5,0,-5,-15,-20,-25,-30,-35,"2d6","P",{"$nulls":5},"Polearms","Javelin (thrust)",45,null,null,"Light Axes","Light Axe"]
[49,"Scimitar","L",100,7,4,4,35,30,20,15,10,5,0,-5,-10,-15,-20,"1d12","C",{"$nulls":5},"Single Edge Blades","Jousting Lance",70,null,null,"Light Axes","Tomahawk"]
[50,"Scimitar (Goblinoid)","L","Found",7,3,3,30,25,15,10,5,0,-5,-10,-15,-15,-20,"1d12","C",{"$nulls":5},"Single Edge Blades","Knife",29,null,null,"Mounted Lance","Jousting Lance"]
[51,"Staff","L",24,4,3,8,40,35,25,15,15,-5,-10,-15,-25,-35,-40,"1d8","B",10,5,5,null,null,"Staves","Light Axe",33,null,null,"Mounted Lance","Combat Lance"]
[52,"War Pick","L",50,7,4,5,35,30,20,20,20,20,20,10,0,-10,-15,"2d6","P",{"$nulls":5},"Cudgels","Light Club",34,null,null,"Polearms","Pitchfork"]
[{"$nulls":26},"Light Sword",35,null,null,"Polearms","Conteux de Breche"]
["Item","Medium Weapons","Class","Cost","Weight","Blows","Length",0,1,2,3,4,5,6,7,8,9,10,"Damage","Type","VL","L","M","H","P","Skill","Long Pike",85,null,null,"Polearms","Fauchard"]
[{"$f":"A63+1","v":53},"Battle Axe","M",50,7,3,6.5,25,25,25,20,20,20,10,0,-5,-10,-10,"1d12","C",{"$nulls":5},"Axes","Long Spear",61,null,null,"Polearms","Fauchard Fork"]
[{"$f":"A66+1","v":54},"Norman War Axe","M",60,10,3,5,25,20,15,15,15,5,0,0,-5,-10,-10,"2d6","C",{"$nulls":5},"Axes","Longsword",46,null,null,"Polearms","Guisarme/Bill"]
[55,"Woodsman's Axe","M",30,5,3,4,25,20,15,10,10,5,0,-5,-10,-10,-10,"2d6","C",{"$nulls":5},"Axes","Lucerne Hammer",83,null,null,"Polearms","Lucerne Hammer"]
[56,"Bastard Sword","M",150,15,2,7,25,20,15,15,15,10,10,5,0,-5,-10,"2d8","C",{"$nulls":5},"Two Edge Blades","Mace",63,null,null,"Polearms","Partisan"]
[57,"Broadsword","M",150,10,3,7,30,30,25,20,15,10,5,5,0,-10,-10,"2d6","C",{"$nulls":5},"Two Edge Blades","Maul",72,null,null,"Polearms","Long Pike"]
[58,"Dwarvish Warhammer","M",150,10,4,4,20,20,15,15,10,5,5,0,-5,-10,-10,"2d6","B",{"$nulls":5},"Hammers","Morning Star",73,null,null,"Polearms","Normal Pike"]
[59,"Heavy Club","M",3,20,3,4,25,20,15,10,10,0,-5,-10,-15,-20,-20,"2d6","B",{"$nulls":5},"Cudgels","Net",38,null,null,"Polearms","Short Pike"]
[60,"Hunting Spear","M",40,4,3,8,25,25,20,15,5,0,-5,-10,-15,-25,-30,"2d6","P",{"$nulls":5},"Spears","Normal Pike",86,null,null,"Polearms","Spontoon"]
[61,"Long Spear","M",75,7.5,2,15,25,25,20,15,15,10,5,0,5,-10,-15,"1d12","P",{"$nulls":5},"Spears","Normal Spear",62,null,null,"Polearms","Footman's Lance"]
[62,"Normal Spear","M",32,4,3,8,30,25,20,15,10,5,0,-5,-10,-15,-20,"2d6","P",{"$nulls":5},"Spears","Normal Sword",47,null,null,"Polearms","Voulge"]
[63,"Mace","M",60,10,3,4,15,15,15,10,10,15,10,0,-5,-10,-10,"2d6","B",{"$nulls":5},"Cudgels","Norman War Axe",54,null,null,"Polearms","War Scythe"]
[64,"Quarterstaff","M",32,4,5,8,40,35,25,15,15,-5,-10,-15,-25,-30,-30,"1d8","B",10,10,5,5,null,"Staves","Partisan",84,null,null,"Short Blades","Light Sword"]
[65,"Ironshod Quarterstaff","M",60,6,5,6,40,35,25,20,20,0,-5,-10,-20,-25,-30,"1d10","B",10,10,10,5,null,"Staves","Pitchfork",48,null,null,"Short Blades","Rapier"]
[66,"Warhammer","M",50,10,3,5,15,15,15,10,10,10,5,5,0,-5,-10,"2d6","B",{"$nulls":5},"Hammers","Quarterstaff",64,null,null,"Short Blades","Short Sword"]
[{"$nulls":26},"Rapier",36,null,null,"Single Edge Blades","Cutlass"]
["Item","Heavy Weapons","Class","Cost","Weight","Blows","Length",0,1,2,3,4,5,6,7,8,9,10,"Damage","Type","VL","L","M","H","P","Skill","Saber",44,null,null,"Single Edge Blades","Saber"]
[{"$f":"A79+1","v":67},"Flail","H",150,15,3,6,30,30,30,30,30,20,15,10,0,0,-5,"1d12","B",10,5,5,null,null,"Flails","Scimitar",49,null,null,"Single Edge Blades","Longsword"]
[{"$f":"A82+1","v":68},"Halberd","H",100,18,3,7,35,35,35,35,35,30,25,15,5,0,-5,"4d6","C",10,5,5,null,null,"Axes","Scimitar (Goblinoid)",50,null,null,"Single Edge Blades","Normal Sword"]
[69,"Hand-and-a-half Sword","H",175,15,2,6,35,30,25,20,15,10,15,0,-5,-10,-15,"2d8","C",{"$nulls":5},"Two Edge Blades","Short Pike",87,null,null,"Single Edge Blades","Scimitar"]
[70,"Jousting Lance","H",15,10,1,16,20,20,20,20,20,20,20,20,20,20,20,"2+","B",{"$nulls":5},"Mounted Lance","Short Sword",37,null,null,"Single Edge Blades","Scimitar (Goblinoid)"]
[71,"Combat Lance","H",50,18,1,16,30,30,30,30,30,30,30,30,30,30,30,"10+","P",{"$nulls":5},"Mounted Lance","Sickle",30,null,null,"Single Edge Blades","Two-Handed Sword"]
[72,"Maul","H",75,12,2,8,20,20,20,20,20,25,20,15,10,5,-10,"2d10","B",{"$nulls":5},"Hammers","Spontoon",88,null,null,"Spears","Javelin (thrust)"]
[73,"Morning Star","H",175,13,2,6,35,35,30,30,30,25,15,10,5,5,0,"2d8","B",10,5,5,null,null,"Flails","Staff",51,null,null,"Spears","Hunting Spear"]
[74,"Two-Handed Battle Axe","H",175,15,2,7,25,20,15,15,15,20,20,10,5,0,-5,"4d6","C",{"$nulls":5},"Axes","Tomahawk",42,null,null,"Spears","Long Spear"]
[75,"Two-Handed Broadsword","H",150,10,2,7,25,25,25,20,15,25,20,15,10,0,0,"2d10","C",{"$nulls":5},"Two Edge Blades","Two-Handed Battle Axe",74,null,null,"Spears","Normal Spear"]
[76,"Two-Handed Flail","H",200,18,2,9,30,25,25,20,20,20,20,15,10,5,0,"4d6","B",{"$nulls":5},"Flails","Two-Handed Broadsword",75,null,null,"Staves","Staff"]
[77,"Two-Handed Sword","H",150,18,2,7,25,25,25,15,10,25,20,15,10,0,-5,"2d10","C",{"$nulls":5},"Single Edge Blades","Two-Handed Flail",76,null,null,"Staves","Quarterstaff"]
[78,"Two-Handed Warhammer","H",100,12,2,6,30,20,20,20,20,20,20,15,5,0,-5,"2d10","B",{"$nulls":5},"Hammers","Two-Handed Sword",77,null,null,"Staves","Ironshod Quarterstaff"]
[{"$nulls":26},"Two-Handed Warhammer",78,null,null,"Throwing Weapons","Net"]
["Item","Polearms","Class","Cost","Weight","Blows","Length",0,1,2,3,4,5,6,7,8,9,10,"Damage","Type","VL","L","M","H","P","Skill","Voulge",90,null,null,"Two Edge Blades","Bastard Sword"]
[{"$f":"A93+1","v":79},"Conteux de Breche","P",100,7,2,10,30,25,25,20,20,15,10,5,-5,-5,-10,"2d10","C",10,5,5,5,null,"Polearms","War Pick",52,null,null,"Cudgels","Broadsword"]
[{"$f":"A96+1","v":80},"Fauchard","P",100,6,2,10,25,25,25,20,20,15,5,0,-10,-10,-15,"2d8","C",10,5,5,5,null,"Polearms","War Scythe",91,null,null,"Two Edge Blades","Hand-and-a-half Sword"]
[81,"Fauchard Fork","P",120,6,2,8,35,35,30,20,20,15,10,0,-5,-5,-10,"2d10","C",10,5,5,5,null,"Polearms","Warhammer",66,null,null,"Two Edge Blades","Two-Handed Broadsword"]
[82,"Guisarme/Bill","P",100,14,3,14,25,25,25,20,20,15,5,0,-10,-10,-15,"2d8","P",10,5,5,5,null,"Polearms","Whipknife",40,null,null,"Whips","Bullwhip"]
[83,"Lucerne Hammer","P",150,8,2,8,30,30,30,25,25,25,20,15,5,5,0,"2d6","P",10,5,5,5,null,"Polearms","Woodsman's Axe",55,null,null,"Whips","Whipknife"]
[84,"Partisan","P",72,6,2,12,30,25,25,20,20,15,10,5,0,0,-5,"2d8","P",10,5,5,5,null,"Polearms"]
[85,"Long Pike","P",150,7.5,2,15,20,20,15,10,5,20,15,10,10,5,0,"2d8","P",10,5,5,5,null,"Polearms"]
[86,"Normal Pike","P",120,6,2,12,25,25,20,15,15,5,5,5,5,0,-5,"1d12","P",10,5,5,5,null,"Polearms"]
[87,"Short Pike","P",80,4,3,8,30,30,25,20,15,5,5,5,5,0,-5,"1d12","P",10,5,5,5,null,"Polearms"]
[88,"Spontoon","P",50,5,2,10,35,25,25,20,20,15,10,5,-5,-5,-15,"1d12","P",10,5,5,5,null,"Polearms"]
[89,"Footman's Lance","P",50,15,2,15,20,20,15,10,5,20,15,10,10,5,0,"2d6+2","P",10,5,5,5,null,"Polearms"]
[90,"Voulge","P",75,10,2,10,30,25,25,25,25,20,15,5,-5,-5,-10,"3d6","P/C",10,5,5,5,null,"Polearms"]
[91,"War Scythe","P",75,5,2,8,50,45,45,40,40,30,15,0,-10,-15,-15,"3d6","P/C",10,5,5,5,null,"Polearms"]
[]
[]
["Item","Shields","Class","Cost","Weight","Blows","Length",0,1,2,3,4,5,6,7,8,9,10,"Damage","Type","VL","L","M","H","P","Skill","Shields","Item"]
[{"$f":"A113-0.1","v":91.9},null,"S",{"$nulls":3},0,{"$nulls":18},"Shields","Armoured Gauntlet",92]
[{"$f":"A108+1","v":92},"Armoured Gauntlet","S",200,10,null,2,{"$nulls":12},"B",10,10,5,5,null,"Shields","Buckler",93]
[{"$f":"A113+1","v":93},"Buckler","S",25,5,3,2,40,30,25,20,15,5,0,-5,-5,-10,-10,"1d6","B",10,10,5,5,null,"Shields","Buckler (Bladed)",94]
[{"$f":"A114+1","v":94},"Buckler (Bladed)","S",125,10,3,2,40,30,25,20,15,5,0,-5,-5,-10,-10,"2d6","B",10,10,5,5,null,"Shields","Buckler (Spiked)",95]
[95,"Buckler (Spiked)","S",75,7,3,2,40,30,25,20,15,5,0,-5,-5,-10,-10,"2d6","B",10,10,5,5,null,"Shields","Kite",103]
[96,"Rondache","S",35,7,3,2,40,30,25,20,15,5,0,-5,-5,-10,-10,"2d6","B",10,10,10,5,5,"Shields","Pavis",102]
[97,"Target (Steel)","S",100,25,3,2,40,30,25,20,15,5,0,-5,-5,-10,-10,"1d8","B",10,10,10,5,5,"Shields","Rondache",96]
[98,"Target (Iron)","S",75,50,3,2,40,30,25,20,15,5,0,-5,-5,-10,-10,"1d8","B",10,10,10,5,5,"Shields","Scutum (Oval)",104]
[99,"Target (Bladed)","S",250,30,3,2,40,30,25,20,15,5,0,-5,-5,-10,-10,"2d6","B",10,10,10,5,5,"Shields","Scutum (Square)",105]
[100,"Target (Spiked)","S",150,27,3,2,40,30,25,20,15,5,0,-5,-5,-10,-10,"2d6","B",10,10,10,5,5,"Shields","Target (Bladed)",99]
[101,"Triangular","S",50,15,3,2,40,30,25,20,15,5,0,-5,-5,-10,-10,"2d6","B",10,10,10,10,10,"Shields","Target (Iron)",98]
[102,"Pavis","S",50,15,3,2,40,30,25,20,15,5,0,-5,-5,-10,-10,"2d6","B",15,15,10,10,10,"Shields","Target (Spiked)",100]
[103,"Kite","S",75,25,3,2,40,30,25,20,15,5,0,-5,-5,-10,-10,"2d6","B",15,15,10,10,10,"Shields","Target (Steel)",97]
[104,"Scutum (Oval)","S",50,25,1,4,25,25,25,20,20,20,15,10,5,0,0,"4d6","B",15,15,15,15,15,"Shields","Triangular",101]
[105,"Scutum (Square)","S",75,30,1,4,25,25,25,20,20,20,15,10,5,0,0,"4d6","B",15,15,15,15,15,"Shields"]
[]
["Item","Missle Weapons","Class","Cost","Weight","Blows","Range",0,1,2,3,4,5,6,7,8,9,10,"Damage","Type","VL","L","M","H","P","Skill","Missle Weapons","Item"]
[{"$f":"A130-0.1","v":105.9},null,"Ms",{"$nulls":4},40,35,30,25,20,15,15,10,5,0,-5,"1d10+5","P",4,{"$nulls":4},"Self Bows","Bolo",119]
[{"$f":"A126+1","v":106},"Light Crossbow","Ms",100,10,1,600,40,35,30,25,20,15,15,10,5,0,-5,"1d10+5","P",4,{"$nulls":4},"Crossbows","Chakra",120]
[{"$f":"A130+1","v":107},"Thieves Crossbow","Ms",175,7,1,600,40,35,30,25,20,15,15,10,5,0,-5,"1d10+5","P",3,{"$nulls":4},"Crossbows","Composite bow",111]
[{"$f":"A131+1","v":108},"Heavy Crossbow","Ms",250,20,0.5,750,45,40,40,35,30,25,25,20,15,10,5,"1d10+7","P",5,{"$nulls":4},"Crossbows","Dart",117]
[109,"Shortbow","Ms",50,3,2,450,35,35,30,20,15,10,5,10,-5,-10,-15,"1d10+3","P",{"$f":"INT(Frontsheet!E6/6)","v":2},{"$nulls":4},"Self Bows","Elvish Longbow",112]
[110,"Longbow","Ms",100,4,2,600,45,45,40,30,25,20,15,10,5,0,-5,"1d10+5","P",{"$f":"INT(Frontsheet!E6/4)","v":4},{"$nulls":4},"Self Bows","Hand Sling",113]
[111,"Composite bow","Ms",125,3,2,600,45,45,40,30,25,20,15,10,5,0,-5,"1d10+5","P",{"$f":"INT(Frontsheet!E6/4)","v":4},{"$nulls":4},"Self Bows","Heavy Crossbow",108]
[112,"Elvish Longbow","Ms",null,4,3,750,50,50,40,30,25,20,20,10,5,0,-5,"1d10+6","P",{"$f":"INT(Frontsheet!E6/4)","v":4},{"$nulls":4},"Self Bows","Javelin",124]
[113,"Hand Sling","Ms",5,1,2,400,35,35,30,15,10,5,5,0,-5,-10,-15,"1d6+3","B",3,{"$nulls":4},"Thrown Weapons","Large Blowgun",116]
[114,"Staff Sling","Ms",6,10,1,450,40,40,40,40,30,20,10,0,-10,-15,-25,"1d10+1","B",3,{"$nulls":4},"Thrown Weapons","Light Crossbow",106]
[115,"Small Blowgun","Ms",10,1,1,30,65,65,55,25,10,-5,-20,-30,-40,-45,-55,"1d2+(p)","P",1,{"$nulls":4},"Eastern Hand Darts","Longbow",110]
[116,"Large Blowgun","Ms",20,1.5,1,50,65,65,55,35,25,15,5,-5,-15,-25,-35,"1d4+(p)","P",2,{"$nulls":4},"Eastern Hand Darts","Rock",118]
[117,"Dart","Ms",2,0.5,4,100,35,35,35,25,15,10,0,-10,-20,-25,-35,"1d10+(p)","P",3,{"$nulls":4},"Thrown Weapons","Shortbow",109]
[118,"Rock","Ms",null,0.5,5,150,40,40,30,10,0,-10,-20,-30,-40,-55,-55,"1d4","B",2,{"$nulls":4},"Thrown Weapons","Small Blowgun",115]
[119,"Bolo","Ms",50,3,1,60,30,30,30,30,30,30,20,10,0,-5,-20,"1d12","B",6,{"$nulls":4},"Thrown Weapons","Spear",123]
[120,"Chakra","Ms",40,0.25,5,60,45,45,40,30,20,0,-10,-15,-20,-25,-35,"1d3+(p)","C",2,{"$nulls":4},"Eastern Hand Darts","Staff Sling",114]
[121,"Throwing Knife","Ms",20,1,4,75,60,60,50,40,40,30,20,10,0,-5,-10,"1d6+(p)","P",2,{"$nulls":4},"Thrown Weapons","Thieves Crossbow",107]
[122,"Throwing Axe","Ms",20,2,3,75,55,55,45,35,35,30,20,10,0,0,-10,"2d6","C",3,{"$nulls":4},"Thrown Weapons","Throwing Axe",122]
[123,"Spear","Ms",24,3,2,75,30,30,30,30,30,30,30,20,10,10,0,"2d4","P",5,{"$nulls":4},"Thrown Weapons","Throwing Knife",121]
[124,"Javelin","Ms",60,3,2,100,40,40,35,30,30,30,25,15,10,10,5,"1d8","P",4,{"$nulls":4},"Thrown Weapons",null,105.9]
[]
["Item","Bare Handed Weapons","Class","Cost","Weight","Blows","Length",0,1,2,3,4,5,6,7,8,9,10,"Damage","Type","VL","L","M","H","P","Skill"]
[{"$f":"A148+1","v":125},"Two Hand Grab-Hd/Lg/Bd","B",null,null,2,null,20,20,10,10,10,10,10,10,10,0,0,{"$nulls":7},"Hand-to-hand"]
[{"$f":"A151+1","v":126},"Two Hand Grab-Arm/Hand","B",null,null,4,null,20,20,10,10,10,10,10,10,10,0,0,{"$nulls":7},"Hand-to-hand"]
[{"$f":"A152+1","v":127},"Two Hand Grab-Weapon","B",null,null,4,null,25,25,15,15,15,15,15,15,15,5,5,{"$nulls":7},"Hand-to-hand"]
[128,"One Hand Grab-Head","B",null,null,4,null,0,0,-10,-10,-10,-10,-10,-10,-10,-20,-20,{"$nulls":7},"Hand-to-hand"]
[129,"One Hand Grab-Arm/Hand","B",null,null,6,null,15,15,5,5,5,5,5,5,5,-5,-5,{"$nulls":7},"Hand-to-hand"]
[130,"One Hand Grab-Weapon","B",null,null,7,null,10,10,0,0,0,0,0,0,0,-10,-10,{"$nulls":7},"Hand-to-hand"]
[131,"One Hand Grab-Leg/Foot","B",null,null,4,null,-20,-20,-30,-30,-30,-30,-30,-30,-30,-40,-40,{"$nulls":7},"Hand-to-hand"]
[132,"One Hand Grab-Body","B",null,null,4,null,-30,-30,-40,-40,-40,-40,-40,-40,-40,-40,-40,{"$nulls":7},"Hand-to-hand"]
[133,"Tackle","B",null,null,4,null,15,10,15,10,15,20,20,20,20,20,20,{"$nulls":7},"Hand-to-hand"]
[134,"Armoured Fist","B",null,null,4,null,30,25,20,15,10,5,0,-5,-10,-15,-20,{"$f":"CONCATENATE(\"1d\",INT(strength/2))","v":"1d8"},{"$nulls":6},"Hand-to-hand"]
[135,"Armoured Foot","B",{"$nulls":4},25,20,15,10,5,0,-10,-15,-15,-20,-25,{"$f":"CONCATENATE(\"2d\",INT(strength/3))","v":"2d5"},{"$nulls":6},"Hand-to-hand"]
[136,"Bare Fist","B",null,null,6,null,30,20,15,10,-10,"n/a","n/a","n/a","n/a","n/a","n/a",{"$f":"CONCATENATE(\"1d\",INT(strength/3))","v":"1d5"},{"$nulls":6},"Hand-to-hand"]
[137,"Bare Foot","B",{"$nulls":4},20,10,5,0,-20,"n/a","n/a","n/a","n/a","n/a","n/a",{"$f":"CONCATENATE(\"2d\",INT(strength/4))","v":"2d4"},{"$nulls":6},"Hand-to-hand"]
[]
[null,"Miscellaneous Equipement"]
[null,"Clothing",null,"Cost","Weight"]
[{"$f":"A163+1","v":138},"Tunic (Mans)",null,9,2]
[{"$f":"A167+1","v":139},"Tunic (Womans)",null,20,2]
[{"$f":"A168+1","v":140},"Chemis (Shirt)",null,5,1]
[141,"Wool Shirt",null,10,3]
[142,"Hose (Stockings)",null,4,0.5]
[143,"Cloth Pants",null,5,1]
[144,"Wool Pants",null,10,3]
[145,"Belt",null,5,0.25]
[146,"Girdle",null,5,0.25]
[147,"Hat",null,4,0.25]
[148,"Mantle/Cloak (Mans)",null,25,3]
[149,"Mantle/Cloak (Womans)",null,40,3]
[150,"Pellison (Gown)",null,6,2]
[151,"Sandels",null,2,0.5]
[152,"Sheath, Dagger",null,3,0.25]
[153,"Sheath, Sword",null,20,0.5]
[154,"Sword Belt",null,6,0.25]
[]
[null,"Boots",null,"Cost","Weight"]
[{"$f":"A183+1","v":155},"Boots,Cloth Riding",null,50,4]
[{"$f":"A186+1","v":156},"Boots,Leather",null,20,3]
[{"$f":"A187+1","v":157},"Boots,Steel Toe",null,50,4]
[{"$f":"A188+1","v":158},"Boots,Leather Infantry",null,25,3]
[{"$f":"A189+1","v":159},"Boots,Steel Toe Infantry",null,50,5]
[{"$f":"A190+1","v":160},"Boots,Steel Plate",null,100,7]
[]
[null,"Gauntlets",null,"Cost","Weight"]
[{"$f":"A191+1","v":161},"Reinforced Mail",null,150,10]
[{"$f":"A194+1","v":162},"Plain Chain Mail",null,100,5]
[{"$f":"A195+1","v":163},"Hardened Leather Gloves",null,10,1]
[{"$f":"A196+1","v":164},"Soft Leather Gloves",null,5,0.25]
[]
[null,"Projectiles",null,"Cost","Weight"]
[{"$f":"A197+1","v":165},"Crossbow Quarrels (20)",null,12,6]
[{"$f":"A200+1","v":166},"Belt Pouch (holds 20 bolts)",null,3,1]
[{"$f":"A201+1","v":167},"Arrows (20)",null,10,2]
[168,"Quiver (holds 20 arrows)",null,5,3]
[169,"Stone Bullets (20)",null,null,1]
[170,"Bronze Bullets (20)",null,35,2]
[171,"Steel Barbed Bullets (20)",null,60,2]
[172,"Glass Hollow Barbed Bullets (20)",null,20,1]
[173,"Belt Pouch (holds 20 bullets)",null,2,1]
[174,"Large Blowgun Darts (10)",null,15,1]
[175,"Large Blowgun Darts,Injector (5)",null,250,0.5]
[176,"Small Blowgun Darts",null,10,0.5]
[177,"Thrown Dart (10)",null,20,5]
[178,"Thrown Dart, Injector (5)",null,250,5]
[179,"Belt Pouch (holds 10 darts)",null,5,1]
[180,"Stone Bolo",null,5,3]
[181,"Bronze Bolo",null,10,2]
[182,"Steel Bolo",null,20,2]
[183,"Silver Bolo",null,150,3]
[]
[null,"Construction,Carpentry & Smithy",null,"Cost","Weight"]
[{"$f":"A218+1","v":184},"Stone Chisel",null,15,1]
[{"$f":"A221+1","v":185},"Rock Drill",null,20,6]
[186,"Cold Chisel",null,15,2]
[187,"String, 100 ft.",null,1,0.5]
[188,"Waxed Cord, 100 ft.",null,10,2]
[189,"Mason's Level",null,25,2]
[190,"Adz",null,20,2]
[191,"Auger",null,20,2]
[192,"Hatchet",null,15,2]
[193,"Wood Chisel",null,10,1]
[194,"Iron Drill Bits (5)",null,20,1]
[195,"Steel Drill Bits (5)",null,50,1]
[196,"Wood Glue, 1 pint",null,2,1]
[197,"Carpenter's Hammer",null,20,2]
[198,"Wooden Mallet",null,20,2]
[199,"Finishing Nails, 250",null,50,1]
[200,"Standard Nails, 100",null,30,1]
[201,"Wood Saw, steel blade",null,75,3]
[202,"Metal Yardstick",null,15,2]
[203,"Wood Yardstick",null,3,1]
[204,"Blacksmith's Hammer",null,15,8]
[205,"Armorer's Hammer",null,15,3]
[206,"Small Tongs",null,10,2]
[207,"Large Tongs",null,20,5]
[]
[null,"Camp & Household",null,"Cost","Weight",null,null,"LB"]
[{"$f":"A244+1","v":208},"Tinderbox, Flint & Steel",null,4,0.25]
[{"$f":"A247+1","v":209},"Matches, (20)",null,200]
[210,"Heavy Blanket",null,50,5]
[211,"Light Blanket",null,25,2]
[212,"Sleeping Furs",null,125,10]
[213,"Mess Kit, pewter",null,40,1]
[214,"Oil Lamp",null,1,1]
[215,"Oil Lantern",null,17,3]
[216,"Lamp Oil (1 pint)",null,2,1]
[217,"Mosquito Netting",null,50,0.25]
[218,"Canvas Tent, 2 man",null,50,30]
[219,"Canvas Tent, 4 man",null,100,60]
[220,"Leather Tent, 2 man",null,75,50]
[221,"Leather Tent, 4 man",null,150,100]
[222,"Perfumed Soap",null,20,0.2]
[223,"Plain Soap",null,5,0.2]
[224,"Pitch Torch",null,0.2,1]
[225,"Bronze Brazier, small",null,20,2]
[226,"Bronze Brazier, tripod",null,20,2]
[227,"Iron Brazier, small",null,20,2]
[228,"Iron Brazier, tripod",null,20,2]
[229,"Charcoal, 1 night",null,1,10]
[230,"Bronze Candelabra",null,25,1]
[231,"Iron Candelabra",null,10,2]
[232,"Wood Candelabra",null,1,0.5]
[233,"Tallow Candle, 1 hr.",null,0.4]
[234,"Wax Candle, 1 hr.",null,0.8]
[235,"Rush Light, 1 hr.",null,0.5]
[]
[null,"Engineering",null,"Cost","Weight"]
[{"$f":"A274+1","v":236},"Light Crowbar",null,10,5]
[{"$f":"A277+1","v":237},"Heavy Crowbar",null,20,10]
[238,"Bronze Spikes (1 in 4 to fail)",null,5,1]
[239,"Iron Spikes (1 in 6 to fail)",null,10,1]
[240,"Steel Spikes (1 in 10 to fail)",null,20,1]
[241,"Iron Wedges (3)",null,6,1]
[242,"Steel Wedges (3)",null,15,1]
[243,"100' Chain, Light",null,45,10]
[244,"Pick Axe",null,50,6]
[245,"Shovel",null,15,3]
[246,"Med. Chain, per ft.",null,20,2]
[247,"Heavy Chain, per ft.",null,60,5]
[248,"Hour Glass",null,350,3]
[249,"Minute Glass, 1 to 5",null,75,0.2]
[250,"Pocket Sundial",null,50,0.2]
[251,"Hemp Rope, per 50'",null,5,3]
[252,"Web Rope, per ft.",null,250,0.05]
[253,"Ladder Rope, per 10'",null,10,3]
[254,"Bronze Grappling Hook (1 in 4 to fail)",null,10,1]
[255,"Iron Grappling Hook (1 in 6 to fail)",null,15,1]
[256,"Steel Grappling Hook (1 in 8 to fail)",null,25,1]
[257,"Rope Pulley, 2:1",null,50,4]
[258,"Rope Pulley, 4:1",null,125,6]
[]
[null,"Containers",null,"Cost","Weight"]
[{"$f":"A299+1","v":259},"Cask, 12.5 gallons",null,35,35]
[{"$f":"A302+1","v":260},"Tin Canteen, 1 pint",null,2,0.5]
[261,"Tin Canteen, 2 pint",null,3,1]
[262,"Porcelain Cup",null,25,0.2]
[263,"Crystal Goblet",null,150,0.1]
[264,"Crystal Goblet, fine",null,600,0.1]
[265,"Gold Goblet",null,250,0.5]
[266,"Porcelain Goblet",null,50,0.1]
[267,"Silver Goblet",null,75,0.5]
[268,"Drinking Horn, fine",null,40,0.5]
[269,"Drinking Horn, plain",null,10,0.2]
[270,"Glass Jar, 1 pint",null,35,1]
[271,"Pewter Mug",null,15,0.5]
[272,"Ceramic vial, 1.2 cup",null,4,0.5]
[273,"Glass vial, .2 cup",null,25]
[274,"Porcelain vial, 1.2 cup",null,20,0.2]
[275,"Silver vial, .2 cup",null,50]
[276,"Tin vial, 1.2 cup",null,25,0.2]
[277,"Waterskin, 1 gallon",null,5,0.2]
[278,"Waterskin, 5 gallons",null,10,1]
[279,"Cloth Pack, 40 lb.",null,2,2]
[280,"Frame Pack, 100 lb.",null,10,4]
[281,"Leather Pack, 75 lb.",null,5,3]
[282,"Large Sack, 2 cu. ft., 100 lb.",null,2,0.5]
[283,"Small Sack, 1 cu. ft., 50 lb.",null,1,0.5]
[]
[null,"Locksmith & Stealth",null,"Cost","Weight"]
[{"$f":"A326+1","v":284},"Complete Kit,",null,75,9]
[null,"three lock picks, #s 1d3, 1d3+3 & 1d3+6; two pass keys, #s 1d6 & 1d6; 10' wire coil; 25' fine cord; cold chisel; iron mallet; pliers"]
[{"$f":"A329+1","v":285},"Lock Pick, #1d3",null,5,0.5]
[{"$f":"A331+1","v":286},"Lock Pick, #1d3+3",null,8,0.5]
[287,"Lock Pick, #1d3+6",null,10,0.5]
[288,"Pass Key, 2X #1d6",null,10]
[289,"10' Wire Coil",null,10,1]
[290,"25' Fine Cord",null,3]
[291,"Cold Chisel",null,15,2]
[292,"Iron Mallet",null,20,2]
[293,"Pliers",null,15,2]
[294,"Lock Pick, #10",null,25]
[295,"Pass Key, #7",null,20]
[296,"Pass Key, #8",null,30]
[297,"Pass Key, #9",null,50]
[298,"Pass Key, #10",null,75]
[299,"Wire Snake",null,250,3]
[300,"Steel Mirror, per sq in",null,5,0.2]
[301,"Silver Mirror, per sq in",null,50,0.3]
[302,"Glass Mirror, per sq in",null,250,0.1]
[]
[null,"Writing Materials",null,"Cost","Weight"]
[{"$f":"A348+1","v":303},"Writing Desk",null,10,10]
[{"$f":"A351+1","v":304},"Paper Sheet",null,1]
[305,"Parchment Sheet",null,2]
[306,"Vellum Sheet",null,3]
[307,"Ink and Pot",null,1,0.2]
[308,"Ink and Pot, Color",null,5,0.2]
[309,"Quill Pen, average",null,0.5]
[310,"Quill Pen, fine",null,1]
[311,"Slate Tablet",null,2,1]
[312,"Chalk, 10 sticks",null,1,1]
[313,"Wax Tablet",null,3,1]
[314,"Stylus",null,1]
[315,"Personal Seal",null,25,0.2]
[316,"Silver Seal",null,100,0.2]
[317,"Gold Seal",null,750,0.4]
[318,"Signet Ring",null,50]
[319,"Sealing Wax, red",null,5,0.1]
[320,"Sealing Ribbon, 10'",null,5]
[321,"Gold Leaf, 16 sq in",null,15,0.2]
[]
[null,"Curative Supplies & Services",null,"Cost","Weight",null,null,"SP","LB"]
[{"$f":"A369+1","v":322},"Cure Light Potion, .5 pint",null,210,0.5]
[{"$f":"A372+1","v":323},"Cure Light Druidic Herb Pack",null,27,0.1]
[324,"Cure Light Service",null,70]
[325,"Cure Serious Potion, .5 pint",null,1500,0.5]
[326,"Cure Serious Druidic Herb Pack",null,250,0.1]
[327,"Cure Serious Service",null,650]
[328,"Cure Grievous Potion, .5 pint",null,5000,0.5]
[329,"Cure Grievous Druidic Herb Pack",null,750,0.1]
[330,"Cure Grievous Service",null,1500]
[331,"Cure Disease Service",null,575]
[332,"Neutralize Poison Potion, 1 pint",null,100,1]
[333,"Neutralize Poison Service",null,115]
[334,"Remove Curse Service",null,400]
[335,"Great Cure Service",null,4000]
[336,"Resurrection Service",null,85000]
[]
[null,"Ritual Equipment",null,"Cost","Weight"]
[{"$f":"A386+1","v":337},"Wooden Cross, 8\"",null,5,0.2]
[{"$f":"A389+1","v":338},"Iron Cross, 6\"",null,15,0.2]
[339,"Silver Cross, 4\"",null,50,0.2]
[340,"Gold Cross, 4\"",null,1250,0.5]
[341,"Silver Dagger, 12\"",null,150,3]
[342,"Silver Sickle, 12\"",null,160,3]
[343,"Holy Water, pint",null,30,1]
[]
[null,"Poison",null,"Cost","Weight","ED"]
[{"$f":"A395+1","v":344},"Curare",null,150]
[{"$f":"A398+1","v":345},"Yew",null,300,null,3]
[{"$f":"A399+1","v":346},"Mezereon",null,200,null,0]
[347,"Belladonna",null,100,null,0]
[348,"Death Cap",null,2500,null,0]
[349,"Ricin",null,1500,null,0]
[350,"Wolfsbane",null,1200,null,1]
[351,"Hemlock",null,600,null,1]
[]
[{"$f":"A405+1","v":352},"Out of Range"]

{"sheet":"Skill List","index":4,"n_rows":462,"n_cols":18,"rows_kept":462}
[null,"Skill Table"]
["#","Methods",{"$nulls":3},"Type"]
[1,"Essence Method",null,null,{"$f":"A3","v":1},"M"]
[{"$f":"A3+1","v":2},"Enchantment Method",null,null,2,"M"]
[3,"Word Method",null,null,3,"M"]
[4,"Prayer Method",null,null,4,"M"]
[5,"Cabal Method",null,null,5,"M"]
[6,"Magic Square Method",null,null,6,"M"]
[7,"Thaumaturgy Method",null,null,7,"M"]
[8,"Ritual Method",null,null,8,"M"]
[]
[null,"Combat Skills"]
[{"$f":"A10+1","v":9},"Axes",null,null,{"$f":"A13","v":9},"S"]
[{"$f":"A13+1","v":10},"Cudgels",null,null,10,"S"]
[11,"Foil",null,null,11,"S"]
[12,"Flails",null,null,12,"S"]
[{"$f":"A16+1","v":13},"Hammers",null,null,{"$f":"A17","v":13},"S"]
[{"$f":"A16+1","v":13},"Hand-to-Hand",null,null,13,"S"]
[14,"Knives",null,null,14,"S"]
[15,"Light Axes",null,null,15,"S"]
[16,"Mounted Lance",null,null,16,"S"]
[17,"Polearms",null,null,17,"S"]
[18,"Short Blades",null,null,18,"S"]
[19,"Shields",null,null,19,"S"]
[20,"Single Edge Blades",null,null,20,"S"]
[21,"Spears",null,null,21,"S"]
[22,"Staves",null,null,22,"S"]
[23,"Two Edge Blades",null,null,23,"S"]
[24,"Whips",null,null,24,"S"]
[25,"Bolo",null,null,25,"S"]
[26,"Crossbows",null,null,26,"S"]
[27,"Eastern Hand Darts",null,null,27,"S"]
[28,"Guns",null,null,28,"S"]
[29,"Self Bows",null,null,29,"S"]
[30,"Thrown Weapons",null,null,30,"S"]
[]
[null,"Weaponless Combat Skills"]
[{"$f":"A35+1","v":31},"Brawl",null,null,{"$f":"A38","v":31},"S"]
[{"$f":"A38+1","v":32},"Dodge",null,null,{"$f":"A39","v":32},"S"]
[{"$f":"A39+1","v":33},"Fisticuffs",null,null,{"$f":"A40","v":33},"S"]
[{"$f":"A40+1","v":34},"Grapple",null,null,{"$f":"A41","v":34},"S"]
[{"$f":"A41+1","v":35},"Tackle",null,null,{"$f":"A42","v":35},"S"]
[]
[null,"Non-Weapon Class Specific Combat Skills"]
[{"$f":"A42+1","v":36},"Berserker Rage",null,null,{"$f":"A45","v":36},"S"]
[{"$f":"A45+1","v":37},"Immobile Opponent Removal",null,null,{"$f":"A46","v":37},"S"]
[]
[null,"Stealth Skills"]
[{"$f":"A46+1","v":38},"Acrobatics",null,null,{"$f":"A49","v":38},"S"]
[{"$f":"A49+1","v":39},"Administration of Poison",null,null,39,"S"]
[{"$f":"A50+1","v":40},"Backstab",null,null,40,"S"]
[{"$f":"A51+1","v":41},"Detect Noises",null,null,41,"S"]
[{"$f":"A51+1","v":41},"Disguise",null,null,41,"S"]
[{"$f":"A52+1","v":42},"Disarm Trap",null,null,42,"S"]
[{"$f":"A54+1","v":43},"Hide in Shadows",null,null,43,"S"]
[44,"Hide in Heat Source",null,null,44,"S"]
[45,"Move Silently",null,null,45,"S"]
[46,"Pick Lock",null,null,46,"S"]
[47,"Pick Pocket",null,null,47,"S"]
[48,"Physical Torture",null,null,48,"S"]
[{"$f":"A60+1","v":49},"Sleight of Hand",null,null,{"$f":"A61","v":49},"S"]
[]
[null,"General Skills"]
[{"$f":"A61+1","v":50},"any craft skill",null,null,{"$f":"A64","v":50},"S"]
[{"$f":"A64+1","v":51},"Leadership",null,null,{"$f":"A65","v":51},"S"]
[]
[null,"Academic"]
[{"$f":"A65+1","v":52},"Apothecary",null,null,{"$f":"A68","v":52},"S"]
[{"$f":"A68+1","v":53},"Architect,Civil",null,null,53,"S"]
[54,"Architect,Naval",null,null,54,"S"]
[55,"Astronomy",null,null,55,"S"]
[56,"Botany",null,null,56,"S"]
[57,"Chemistry",null,null,57,"S"]
[58,"Chirurgery",null,null,58,"S"]
[59,"Finance",null,null,59,"S"]
[60,"Gemology",null,null,60,"S"]
[61,"Herbalism",null,null,61,"S"]
[62,"Mathematics",null,null,62,"S"]
[63,"Mechanician",null,null,63,"S"]
[64,"Metallurgy",null,null,64,"S"]
[65,"Military Engineer",null,null,65,"S"]
[66,"Physician",null,null,66,"S"]
[]
[null,"Arts & Crafts"]
[{"$f":"A82+1","v":67},"Agriculture",null,null,{"$f":"A85","v":67},"S"]
[{"$f":"A85+1","v":68},"Animal Training",null,null,68,"S"]
[{"$f":"A86+1","v":69},"Armory",null,null,69,"S"]
[{"$f":"A86+1","v":69},"Bargain",null,null,69,"S"]
[{"$f":"A87+1","v":70},"Blacksmithy",null,null,70,"S"]
[{"$f":"A89+1","v":71},"Cabinetry",null,null,71,"S"]
[72,"Carpentry",null,null,72,"S"]
[73,"Cartwright",null,null,73,"S"]
[74,"Cobbling",null,null,74,"S"]
[75,"Cordmaking",null,null,75,"S"]
[76,"Dancing",null,null,76,"S"]
[77,"Falconry",null,null,77,"S"]
[78,"Fishing",null,null,78,"S"]
[79,"Forestry",null,null,79,"S"]
[80,"Gambling",null,null,{"$f":"A99","v":80},"S"]
[81,"Glassblowing",null,null,81,"S"]
[82,"Ink & Paper Making",null,null,82,"S"]
[83,"Instrument Playing",null,null,83,"S"]
[84,"Jewelsmithy",null,null,84,"S"]
[85,"Juggling/Foolery",null,null,85,"S"]
[86,"Masonry",null,null,86,"S"]
[87,"Mining",null,null,87,"S"]
[88,"Painting & Drawing",null,null,88,"S"]
[89,"Poetry",null,null,89,"S"]
[90,"Ranching",null,null,90,"S"]
[91,"Riding",null,null,91,"S"]
[92,"Sailmaking",null,null,92,"S"]
[93,"Sculpting",null,null,93,"S"]
[94,"Shipbuilding",null,null,94,"S"]
[95,"Singing",null,null,95,"S"]
[96,"Weaving",null,null,96,"S"]
[]
[null,"Language"]
[{"$f":"A115+1","v":97},"language:modern",null,null,{"$f":"A118","v":97},"S"]
[{"$f":"A118+1","v":98},"language:ancient",null,null,98,"S"]
[{"$f":"A119+1","v":99},"language:secret",null,null,99,"S"]
[100,"Language:Centaur",null,null,100,"S"]
[101,"Language:Dwarf",null,null,101,"S"]
[102,"Language:High Dwarf",null,null,102,"S"]
[103,"Language:Elvish",null,null,103,"S"]
[104,"Language:High Elvish",null,null,104,"S"]
[105,"Language:Gnome",null,null,105,"S"]
[106,"Language:Hobbit",null,null,106,"S"]
[107,"Language:Orc",null,null,107,"S"]
[108,"Language:Pixie",null,null,108,"S"]
[109,"Language:Saurig",null,null,109,"S"]
[110,"Language(A):Arabic",null,null,110,"S"]
[111,"Language(A):Celtic",null,null,111,"S"]
[112,"Language(A):Greek",null,null,112,"S"]
[113,"Language(A):Hebrew",null,null,113,"S"]
[114,"Language(A):Latin",null,null,114,"S"]
[115,"Language(A):Mandrin",null,null,115,"S"]
[116,"Language(A):Sanscrit",null,null,116,"S"]
[117,"Language(S):Assassin",null,null,117,"S"]
[118,"Language(S):Trade",null,null,118,"S"]
[119,"Language(S):Thief",null,null,119,"S"]
[120,"Language:Signing",null,null,120,"S"]
[121,"Language:Music",null,null,121,"S"]
[]
[null,"Service Skills"]
[{"$f":"A142+1","v":122},"Barbering",null,null,{"$f":"A145","v":122},"S"]
[{"$f":"A145+1","v":123},"Cooking",null,null,{"$f":"A146","v":123},"S"]
[{"$f":"A146+1","v":124},"Courtesan",null,null,{"$f":"A147","v":124},"S"]
[{"$f":"A147+1","v":125},"Service",null,null,{"$f":"A148","v":125},"S"]
[]
[null,"Spell Skills",{"$nulls":4},"Affinity","Plus","Affinity2","Plus2","Affinity3","Plus3","Affinity4","Plus4","Difficulty","Stamina","Save","Effect"]
[{"$f":"A148+1","v":126},"any spell",null,null,{"$f":"A151","v":126},"C",null,0,null,0,null,0,null,0,null,null,"-"]
[{"$f":"A151+1","v":127},"augury spell",null,null,{"$f":"A152","v":127},"C",20,1,null,0,null,0,null,0,null,null,"-"]
[{"$f":"A152+1","v":128},"coercive spell",null,null,{"$f":"A153","v":128},"C",9,1,10,2,11,1,12,1,null,null,"-"]
[129,"constitutive spell",null,null,129,"C",13,1,null,0,null,0,null,0,null,null,"-"]
[130,"miraculous spell",null,null,{"$f":"A155","v":130},"C",17,2,18,2,null,0,null,0,null,null,"-"]
[131,"nature miracle",null,null,{"$f":"A156","v":131},"C",20,2,null,0,null,0,null,0,null,null,"-"]
[132,"physical spell",null,null,132,"C",13,1,null,0,null,0,null,0,null,null,"-"]
[133,"thereputic spell",null,null,133,"C",12,1,16,2,19,2,20,2,null,null,"-"]
[134,"traumatic spell",null,null,134,"C",9,2,19,1,null,0,null,0,null,null,"-"]
[]
[null,"Augury Spells",{"$nulls":4},"Affinity","Plus","Affinity2","Plus2","Affinity3","Plus3","Affinity4","Plus4","Difficulty","Stamina","Save","Effect"]
[{"$f":"A159+1","v":135},"Detect Demeanor",null,null,{"$f":"A162","v":135},"C",20,1,null,0,null,0,null,0,"d3",1,"-"]
[{"$f":"A162+1","v":136},"Detect Altitude",null,null,136,"C",20,1,null,0,null,0,null,0,"d2",1,"-"]
[137,"Detect Life",null,null,137,"C",20,1,null,0,null,0,null,0,"d3",1,"-"]
[138,"Detect Etheric",null,null,138,"C",20,1,null,0,null,0,null,0,"d3",2,"-"]
[139,"Detect Metal",null,null,139,"C",20,1,null,0,null,0,null,0,"d3",1,"-"]
[140,"Detect Secret Door",null,null,140,"C",20,1,null,0,null,0,null,0,"d3",1,"-"]
[141,"Detect Tracks",null,null,141,"C",20,1,null,0,null,0,null,0,"d3",1,"-"]
[142,"Detect Direction",null,null,142,"C",20,1,null,0,null,0,null,0,"d2",1,"-"]
[143,"Detect Distance",null,null,143,"C",20,1,null,0,null,0,null,0,"d3",1,"-"]
[144,"Detect Volume",null,null,144,"C",20,1,null,0,null,0,null,0,"d3",1,"-"]
[145,"Detect Shifting Walls",null,null,145,"C",20,1,null,0,null,0,null,0,"d3",1,"-"]
[146,"Detect Sloping",null,null,146,"C",20,1,null,0,null,0,null,0,"d3",1,"-"]
[147,"Detect Passages",null,null,147,"C",20,1,null,0,null,0,null,0,"d3",1,"-"]
[148,"Detect Small Traps",null,null,148,"C",20,1,null,0,null,0,null,0,"d3",1,"-"]
[149,"Detect Large Traps",null,null,149,"C",20,1,null,0,null,0,null,0,"d3",1,"-"]
[150,"Detect Enemies",null,null,150,"C",20,1,null,0,null,0,null,0,"d3",2,"-"]
[151,"Detect Evil",null,null,151,"C",20,1,null,0,null,0,null,0,"d3",2,"-"]
[152,"Detect Good",null,null,152,"C",20,1,null,0,null,0,null,0,"d3",2,"-"]
[153,"Detect Jewel",null,null,153,"C",20,1,null,0,null,0,null,0,"d3",3,"-"]
[154,"Detect Poison",null,null,154,"C",20,1,null,0,null,0,null,0,"d3",2,"-"]
[155,"Detect Old Tracks",null,null,155,"C",20,1,null,0,null,0,null,0,"Spcl",2,"-"]
[156,"Detect Observation",null,null,156,"C",20,1,null,0,null,0,null,0,"d3",2,"-"]
[157,"Detect Path",null,null,157,"C",20,1,null,0,null,0,null,0,"d2",3,"-"]
[158,"Detect Unknown Path",null,null,158,"C",20,1,null,0,null,0,null,0,"d3","1/5m","-"]
[159,"Detect Illusion",null,null,159,"C",20,1,null,0,null,0,null,0,"d3",4,"-"]
[160,"Detect Damage/Disease",null,null,{"$f":"A187","v":160},"C",20,1,null,0,null,0,null,0,"d3",2,"-"]
[]
[null,"Coercive Magic",{"$nulls":4},"Affinity","Plus","Affinity2","Plus2","Affinity3","Plus3","Affinity4","Plus4","Difficulty","Stamina","Save","Effect"]
[{"$f":"A187+1","v":161},"Awaken",null,null,{"$f":"A190","v":161},"C",9,1,10,2,11,1,12,1,"d2","1+","-"]
[{"$f":"A190+1","v":162},"Charm Person",null,null,162,"C",9,1,10,2,11,1,12,1,"Chrm",1,"-"]
[163,"Sleep",null,null,163,"C",9,1,10,2,11,1,12,1,"d2","1+","-"]
[164,"Charm Small Animal",null,null,164,"C",9,1,10,2,11,1,12,1,"d3",2,"-"]
[165,"Clumsiness",null,null,165,"C",9,1,10,2,11,1,12,1,"d3",2,"-"]
[166,"Hold Small Animal",null,null,166,"C",9,1,10,2,11,1,12,1,"d3",2,"-"]
[167,"Muscle Spasm",null,null,167,"C",9,1,10,2,11,1,12,1,"d2",2,"-"]
[168,"Command Small Animal",null,null,168,"C",9,1,10,2,11,1,12,1,"d4",2,"-"]
[169,"Hold Large Animal",null,null,169,"C",9,1,10,2,11,1,12,1,"d3",3,"-"]
[170,"Command Large Animal",null,null,170,"C",9,1,10,2,11,1,12,1,"d4",4,"-"]
[171,"Hold Person",null,null,171,"C",9,1,10,2,11,1,12,1,"d4",4,"-"]
[172,"Summan Animal",null,null,172,"C",9,1,10,2,11,1,12,1,"d5",4,"-"]
[173,"Hold Monster",null,null,173,"C",9,1,10,2,11,1,12,1,"d5",5,"-"]
[174,"Word of Power:Deafen",null,null,174,"C",9,1,10,2,11,1,12,1,"d4",4,"-"]
[175,"Word of Power:Stun",null,null,175,"C",9,1,10,2,11,1,12,1,"d5",5,"-"]
[176,"Berserker Rage",null,null,176,"C",9,1,10,2,11,1,12,1,"d6",6,"-"]
[177,"Bravery",null,null,177,"C",9,1,10,2,11,1,12,1,"d6",6,"-"]
[178,"Confusion",null,null,178,"C",9,1,10,2,11,1,12,1,"d6",6,"-"]
[179,"Fear",null,null,179,"C",9,1,10,2,11,1,12,1,"d6",6,"-"]
[180,"Hate",null,null,180,"C",9,1,10,2,11,1,12,1,"d6",5,"-"]
[181,"Love",null,null,181,"C",9,1,10,2,11,1,12,1,"d6",5,"-"]
[182,"Hypnotize",null,null,182,"C",9,1,10,2,11,1,12,1,"Int",4,"-"]
[]
[null,"Constitutive Magic",{"$nulls":4},"Affinity","Plus","Affinity2","Plus2","Affinity3","Plus3","Affinity4","Plus4","Difficulty","Stamina","Save","Effect"]
[{"$f":"A211+1","v":183},"Etheric Lock",null,null,{"$f":"A214","v":183},"C",13,1,null,0,null,0,null,0,"d4",3,"-"]
[{"$f":"A214+1","v":184},"Etheric Projection",null,null,184,"C",13,1,null,0,null,0,null,0,"d3",2,"-"]
[185,"Etheric Sight",null,null,185,"C",13,1,null,0,null,0,null,0,"d3",1,"-"]
[186,"Etheric Connection",null,null,{"$f":"A217","v":186},"C",13,1,null,0,null,0,null,0,"d5",3,"-"]
[187,"Etheric Travel",null,null,187,"C",13,1,null,0,null,0,null,0,"d7","4/hr","-"]
[188,"Far Sight",null,null,188,"C",13,1,null,0,null,0,null,0,"d4",3,"-"]
[189,"Fly",null,null,189,"C",13,1,null,0,null,0,null,0,"d3",2,"-"]
[190,"Gaseous Form",null,null,190,"C",13,1,null,0,null,0,null,0,"d7",6,"-"]
[191,"Grow/Dimish",null,null,191,"C",13,1,null,0,null,0,null,0,"d5",5,"-"]
[192,"Haste",null,null,192,"C",13,1,null,0,null,0,null,0,"d5",4,"-"]
[193,"Hear",null,null,193,"C",13,1,null,0,null,0,null,0,"d3",1,"-"]
[194,"Hold Portal",null,null,194,"C",13,1,null,0,null,0,null,0,"d3",2,"-"]
[195,"Knock",null,null,195,"C",13,1,null,0,null,0,null,0,"d4",3,"-"]
[196,"Levitate",null,null,196,"C",13,1,null,0,null,0,null,0,"d3",2,"-"]
[197,"Move Earth",null,null,197,"C",13,1,null,0,null,0,null,0,"d8",8,"-"]
[198,"Night Vision",null,null,198,"C",13,1,null,0,null,0,null,0,"d3",2,"-"]
[199,"Noise",null,null,199,"C",13,1,null,0,null,0,null,0,"d3",2,"-"]
[200,"Passwall",null,null,200,"C",13,1,null,0,null,0,null,0,"d4",2,"-"]
[201,"Resist Cold",null,null,{"$f":"A232","v":201},"C",13,1,17,1,18,1,20,1,"d4",4,"-"]
[202,"Resist Fire",null,null,202,"C",13,1,17,1,18,1,20,1,"d5",5,"-"]
[203,"Shape Change",null,null,203,"C",13,1,null,1,null,0,null,0,"d6",5,"-"]
[204,"Silence",null,null,204,"C",13,1,null,0,null,0,null,0,"d3","3+","-"]
[205,"Speed",null,null,205,"C",13,1,null,0,null,0,null,0,"d5",4,"-"]
[206,"Strength",null,null,206,"C",13,1,null,0,null,0,null,0,"d5",4,"-"]
[207,"Telepathy",null,null,{"$f":"A238","v":207},"C",13,1,null,0,null,0,null,0,"1/2wrd",4,"-"]
[208,"Teleport",null,null,208,"C",13,1,null,0,null,0,null,0,"Spcl",4,"-"]
[209,"Teleportal",null,null,209,"C",13,1,null,0,null,0,null,0,"Spcl",5,"-"]
[210,"Ventriloquism",null,null,210,"C",13,1,null,0,null,0,null,0,"d3",1,"-"]
[211,"Water Breathing",null,null,211,"C",13,1,20,1,null,0,null,0,"d5",4,"-"]
[]
[null,"Illusive Magic",{"$nulls":4},"Affinity","Plus","Affinity2","Plus2","Affinity3","Plus3","Affinity4","Plus4","Difficulty","Stamina","Save","Effect"]
[{"$f":"A242+1","v":212},"Illusion,Sight",null,null,{"$f":"A245","v":212},"C",11,2,null,0,null,0,null,0,"d2",1,"Int/4"]
[{"$f":"A245+1","v":213},"Illusion,Sound",null,null,213,"C",11,2,null,0,null,0,null,0,"d2",2,"Int/4"]
[{"$f":"A246+1","v":214},"Illusion,Smell",null,null,214,"C",11,2,null,0,null,0,null,0,"d3",2,"Int/4"]
[{"$f":"A247+1","v":215},"Illusion,Touch",null,null,215,"C",11,2,null,0,null,0,null,0,"d3",4,"Int/5"]
[{"$f":"A248+1","v":216},"Illusion,Taste",null,null,216,"C",11,2,null,0,null,0,null,0,"d4",3,"Int/5"]
[{"$f":"A249+1","v":217},"Illusion,Change",null,null,217,"C",11,2,null,0,null,0,null,0,"d4",4,"Int/5"]
[]
[null,"Miraculous Skills",{"$nulls":4},"Affinity","Plus","Affinity2","Plus2","Affinity3","Plus3","Affinity4","Plus4","Difficulty","Stamina","Save","Effect"]
[{"$f":"A250+1","v":218},"Banish (M)",null,null,{"$f":"A253","v":218},"C",17,2,18,2,null,0,null,0,"d8",6,"-"]
[{"$f":"A253+1","v":219},"Benediction (M)",null,null,{"$f":"A254","v":219},"C",17,2,18,2,null,0,null,0,"d3",2,"-"]
[{"$f":"A254+1","v":220},"Bravery (M)",null,null,220,"C",17,2,18,2,null,0,null,0,"d6",6,"-"]
[221,"Call Food Animal (M)",null,null,221,"C",17,2,18,2,null,0,null,0,"d3",2,"-"]
[222,"Confession/Absolution (M)",null,null,222,"C",17,2,18,2,null,0,null,0,"d2",1,"-"]
[223,"Cure Disease (M)",null,null,223,"C",17,2,18,2,null,0,null,0,"d4",3,"-"]
[224,"Exorcism (M)",null,null,224,"C",17,2,18,2,null,0,null,0,"d7",5,"-"]
[225,"Heal Minor Wound (M)",null,null,225,"C",17,2,18,2,null,0,null,0,"d3",1,"-"]
[226,"Heal Serious Wound (M)",null,null,226,"C",17,2,18,2,null,0,null,0,"d5",2,"-"]
[227,"Last Rites (M)",null,null,{"$f":"A262","v":227},"C",17,2,18,2,null,0,null,0,"d4",2,"-"]
[228,"Protection from Evil (M)",null,null,228,"C",17,2,18,2,null,0,null,0,"d3",2,"-"]
[229,"Protection from Magic (M)",null,null,229,"C",17,2,18,2,null,0,null,0,"d4",4,"-"]
[230,"Purify Spring or Pool (M)",null,null,230,"C",17,2,18,2,null,0,null,0,"d6",5,"-"]
[231,"Raise Dead (M)",null,null,231,"C",17,2,18,2,null,0,null,0,"d8",8,"-"]
[232,"Recognize Evil (M)",null,null,{"$f":"A267","v":232},"C",17,2,18,2,null,0,null,0,"d3",2,"-"]
[233,"Regeneration (M)",null,null,233,"C",17,2,18,2,null,0,null,0,"d7",6,"-"]
[234,"Walk on Water (M)",null,null,234,"C",17,2,18,2,null,0,null,0,"d8",4,"-"]
[235,"Water to Wine (M)",null,null,{"$f":"A270","v":235},"C",17,2,18,2,null,0,null,0,"d5","1/L","-"]
[236,"Wedding Rites (M)",null,null,236,"C",17,2,18,2,null,0,null,0,"d3",2,"-"]
[]
[null,"Nature Miracles",{"$nulls":4},"Affinity","Plus","Affinity2","Plus2","Affinity3","Plus3","Affinity4","Plus4","Difficulty","Stamina","Save","Effect"]
[{"$f":"A271+1","v":237},"Animal Control",null,null,{"$f":"A274","v":237},"C",20,2,null,0,null,0,null,0,"d4",3,"-","Animal obeys 1-6 word commands, retest for complex or dangerous commands"]
[{"$f":"A274+1","v":238},"Animal Form",null,null,{"$f":"A275","v":238},"C",20,2,null,0,null,0,null,0,"d4","2+","-","Caster assumes Shape / Movement / Senses of an animal, +1d & Stamina per Size / Weight change and Sense added"]
[239,"Animal Friend",null,null,239,"C",20,2,null,0,null,0,null,0,"d5",3,"-","Animal becomes a pet for 1 year, like control"]
[240,"Animal Invisibility",null,null,240,"C",20,2,null,0,null,0,null,0,"d3",3,"-","Animals cannot detect target"]
[241,"Animal Locate",null,null,{"$f":"A278","v":241},"C",20,2,null,0,null,0,null,0,"d2",1,"-","Locate nearest animal, +1d for specific type of animal"]
[242,"Animal Movement",null,null,242,"C",20,2,null,0,null,0,null,0,"d3","2/hr","-","Move like specific animal (run like a wolf)"]
[243,"Animal Summon",null,null,243,"C",20,2,null,0,null,0,null,0,"d3",2,"-","Summon nearest animal, +1d for specific animal"]
[244,"Call Lightning",null,null,244,"C",20,2,null,0,null,0,null,0,"d4",2,"-","Summon lightning from the sky to strike specific object 1 time / min, does 1d12"]
[245,"Commune with Nature",null,null,245,"C",20,2,null,0,null,0,null,0,"d2",1,"-","After successful casting, outdoors skills are at -1d / 5%"]
[{"$f":"A282+1","v":246},"Control Temperature",null,null,246,"C",20,2,null,0,null,0,null,0,"d5",4,"-","Raise / Lower temperature in local area (takes 2 hours)"]
[247,"Control Weather",null,null,247,"C",20,2,null,0,null,0,null,0,"d8",6,"-","Change multiple weather elements in a local area (takes a day)"]
[248,"Control Winds",null,null,248,"C",20,2,null,0,null,0,null,0,"d6",5,"-","Create / Calm Winds in a local area (takes 2 hours)"]
[249,"Element Protection",null,null,{"$f":"A286","v":249},"C",20,2,null,0,null,0,null,0,"d2/elm","1/elm","-","Protection from the elements, each element added adds difficulty / stamina cost"]
[250,"Elemental Control",null,null,{"$f":"A287","v":250},"C",20,2,null,0,null,0,null,0,"d5",5,"-","Elemental obeys 1-2 word commands, retest for complex or dangerous commands"]
[251,"Elemental Locate",null,null,{"$f":"A288","v":251},"C",20,2,null,0,null,0,null,0,"d3",2,"-","Locate nearest elemental, +1d for specific type of elemental"]
[252,"Elemental Summon",null,null,{"$f":"A289","v":252},"C",20,2,null,0,null,0,null,0,"d4",3,"-","Summon nearest elemental, +1d for specific elemental"]
[253,"Entangle",null,null,253,"C",20,2,null,0,null,0,null,0,"d3",2,"-","Roots & Grass entagle the feet of target, multiple add +1d / 10, causes slowness / -1d / 5% on tests"]
[254,"Faerie Fire",null,null,254,"C",20,2,null,0,null,0,null,0,"d3",2,"-","Faerie light covers target (no damage)"]
[255,"Insect Control",null,null,{"$f":"A292","v":255},"C",20,2,null,0,null,0,null,0,"d5",4,"-","Insect obeys 1-2 word commands, retest for complex or dangerous commands"]
[256,"Insect Invisibility",null,null,{"$f":"A293","v":256},"C",20,2,null,0,null,0,null,0,"d3",3,"-","Insects cannot detect target"]
[257,"Insect Locate",null,null,{"$f":"A294","v":257},"C",20,2,null,0,null,0,null,0,"d2",1,"-","Locate nearest insect, +1d for specific type of insect"]
[258,"Insect Summon",null,null,{"$f":"A295","v":258},"C",20,2,null,0,null,0,null,0,"d3",2,"-","Summon nearest insect, +1d for specific insect"]
[259,"Pass without Trace",null,null,259,"C",20,2,null,0,null,0,null,0,"d3",3,"-","Pass through vegetation without hinderance or leaving tracks"]
[260,"Predict Weather",null,null,260,"C",20,2,null,0,null,0,null,0,"d3",1,"-","Predict tomorrow's weather, +1d additional days"]
[261,"Skin of Bark",null,null,261,"C",20,2,null,0,null,0,null,0,"d3",3,"-","Skin hardens, -10% to enemy attacks, -1d for enemy spells"]
[262,"Skin of Stone",null,null,262,"C",20,2,null,0,null,0,null,0,"d5",3,"-","Skin hardens, -20% to enemy attacks, -2d for enemy spells"]
[263,"Snare",null,null,263,"C",20,2,null,0,null,0,null,0,"d3",3,"-","Magical Snare for small animals, +1d for each larger size"]
[264,"Tree Form",null,null,264,"C",20,2,null,0,null,0,null,0,"d4",4,"-","Assume form of a small tree"]
[265,"Wall of Thorns",null,null,265,"C",20,2,null,0,null,0,null,0,"d5",4,"-","Living thorn barrier (permanent), miracle len, 5 ft deep, 1d6 damage / barrier passed"]
[]
[null,"Physical Magic",{"$nulls":4},"Affinity","Plus","Affinity2","Plus2","Affinity3","Plus3","Affinity4","Plus4","Difficulty","Stamina","Save","Effect"]
[{"$f":"A302+1","v":266},"Dense Rock,Create",null,null,{"$f":"A305","v":266},"C",13,1,null,0,null,0,null,0,"d4",2,"-"]
[{"$f":"A305+1","v":267},"Dense Rock,Detach",null,null,267,"C",13,1,null,0,null,0,null,0,"d6",3,"-"]
[268,"Dense Rock,Affix",null,null,268,"C",13,1,null,0,null,0,null,0,"d6",3,"-"]
[269,"Dense Rock,Amplify",null,null,269,"C",13,1,null,0,null,0,null,0,"d7",3,"-"]
[270,"Dense Rock,Accelerate",null,null,270,"C",13,1,null,0,null,0,null,0,"d7",3,"-"]
[271,"Dense Rock,Concentrate",null,null,271,"C",13,1,null,0,null,0,null,0,"d6",3,"-"]
[272,"Dense Rock,Remove",null,null,272,"C",13,1,null,0,null,0,null,0,"d4",2,"-"]
[273,"Porous Rock,Create",null,null,273,"C",13,1,null,0,null,0,null,0,"d4",2,"-"]
[274,"Porous Rock,Detach",null,null,274,"C",13,1,null,0,null,0,null,0,"d4",3,"-"]
[275,"Porous Rock,Affix",null,null,275,"C",13,1,null,0,null,0,null,0,"d4",3,"-"]
[276,"Porous Rock,Amplify",null,null,276,"C",13,1,null,0,null,0,null,0,"d6",3,"-"]
[277,"Porous Rock,Accelerate",null,null,277,"C",13,1,null,0,null,0,null,0,"d6",3,"-"]
[278,"Porous Rock,Concentrate",null,null,278,"C",13,1,null,0,null,0,null,0,"d5",3,"-"]
[279,"Porous Rock,Remove",null,null,279,"C",13,1,null,0,null,0,null,0,"d4",2,"-"]
[280,"Sand,Create",null,null,280,"C",13,1,null,0,null,0,null,0,"d2",1,"-"]
[281,"Sand,Detach",null,null,281,"C",13,1,null,0,null,0,null,0,"d2",1,"-"]
[282,"Sand,Affix",null,null,282,"C",13,1,null,0,null,0,null,0,"d3",1,"-"]
[283,"Sand,Amplify",null,null,283,"C",13,1,null,0,null,0,null,0,"d3",2,"-"]
[284,"Sand,Accelerate",null,null,284,"C",13,1,null,0,null,0,null,0,"d3",2,"-"]
[285,"Sand,Concentrate",null,null,285,"C",13,1,null,0,null,0,null,0,"d4",2,"-"]
[286,"Sand,Remove",null,null,286,"C",13,1,null,0,null,0,null,0,"d2",1,"-"]
[287,"Dust,Create",null,null,287,"C",13,1,null,0,null,0,null,0,"d2",1,"-"]
[288,"Dust,Detach",null,null,288,"C",13,1,null,0,null,0,null,0,"d2",1,"-"]
[289,"Dust,Affix",null,null,289,"C",13,1,null,0,null,0,null,0,"d3",1,"-"]
[290,"Dust,Amplify",null,null,290,"C",13,1,null,0,null,0,null,0,"d3",2,"-"]
[291,"Dust,Accelerate",null,null,291,"C",13,1,null,0,null,0,null,0,"d3",2,"-"]
[292,"Dust,Concentrate",null,null,292,"C",13,1,null,0,null,0,null,0,"d3",2,"-"]
[293,"Dust,Remove",null,null,293,"C",13,1,null,0,null,0,null,0,"d2",1,"-"]
[294,"Wind,Create",null,null,294,"C",13,1,null,0,null,0,null,0,"d3",2,"-"]
[295,"Wind,Detach",null,null,295,"C",13,1,null,0,null,0,null,0,"d2",2,"-"]
[296,"Wind,Affix",null,null,296,"C",13,1,null,0,null,0,null,0,"d4",2,"-"]
[297,"Wind,Amplify",null,null,297,"C",13,1,null,0,null,0,null,0,null,null,"-"]
[298,"Wind,Accelerate",null,null,{"$f":"A337","v":298},"C",13,1,null,0,null,0,null,0,"d3",3,"-"]
[{"$f":"A337+1","v":299},"Wind,Intensify",null,null,299,"C",13,1,null,0,null,0,null,0,"d3",4,"-"]
[300,"Wind,Remove",null,null,300,"C",13,1,null,0,null,0,null,0,"d3",3,"-"]
[301,"Posion Gas,Create",null,null,301,"C",13,1,null,0,null,0,null,0,"d4",6,"-"]
[302,"Posion Gas,Detach",null,null,302,"C",13,1,null,0,null,0,null,0,"d4",6,"-"]
[303,"Posion Gas,Affix",null,null,303,"C",13,1,null,0,null,0,null,0,"d4",6,"-"]
[304,"Posion Gas,Amplify",null,null,304,"C",13,1,null,0,null,0,null,0,null,null,"-"]
[305,"Posion Gas,Accelerate",null,null,305,"C",13,1,null,0,null,0,null,0,"d4",7,"-"]
[306,"Posion Gas,Intensify",null,null,306,"C",13,1,null,0,null,0,null,0,"d4",7,"-"]
[307,"Posion Gas,Remove",null,null,307,"C",13,1,null,0,null,0,null,0,"d3",3,"-"]
[308,"Heat,Create",null,null,308,"C",13,1,null,0,null,0,null,0,"d3",3,"-"]
[309,"Heat,Detach",null,null,309,"C",13,1,null,0,null,0,null,0,"d3",3,"-"]
[310,"Heat,Affix",null,null,310,"C",13,1,null,0,null,0,null,0,"d3",3,"-"]
[311,"Heat,Amplify",null,null,311,"C",13,1,null,0,null,0,null,0,"d3",4,"-"]
[312,"Heat,Accelerate",null,null,312,"C",13,1,null,0,null,0,null,0,"d4",5,"-"]
[313,"Heat,Intensify",null,null,313,"C",13,1,null,0,null,0,null,0,"d4",6,"-"]
[314,"Heat,Remove",null,null,314,"C",13,1,null,0,null,0,null,0,"d3",2,"-"]
[315,"Cold,Create",null,null,315,"C",13,1,null,0,null,0,null,0,"d3",3,"-"]
[316,"Cold,Detach",null,null,316,"C",13,1,null,0,null,0,null,0,"d3",3,"-"]
[317,"Cold,Affix",null,null,317,"C",13,1,null,0,null,0,null,0,"d3",3,"-"]
[318,"Cold,Amplify",null,null,318,"C",13,1,null,0,null,0,null,0,"d3",4,"-"]
[319,"Cold,Accelerate",null,null,319,"C",13,1,null,0,null,0,null,0,"d4",5,"-"]
[320,"Cold,Intensify",null,null,320,"C",13,1,null,0,null,0,null,0,"d4",6,"-"]
[321,"Cold,Remove",null,null,321,"C",13,1,null,0,null,0,null,0,"d3",2,"-"]
[322,"Smoke,Create",null,null,322,"C",13,1,null,0,null,0,null,0,"d3",1,"-"]
[323,"Smoke,Detach",null,null,323,"C",13,1,null,0,null,0,null,0,"d2",1,"-"]
[324,"Smoke,Affix",null,null,324,"C",13,1,null,0,null,0,null,0,"d3",1,"-"]
[325,"Smoke,Amplify",null,null,325,"C",13,1,null,0,null,0,null,0,"d3",2,"-"]
[326,"Smoke,Accelerate",null,null,326,"C",13,1,null,0,null,0,null,0,"d3",3,"-"]
[327,"Smoke,Intensify",null,null,327,"C",13,1,null,0,null,0,null,0,"d3",4,"-"]
[328,"Smoke,Remove",null,null,328,"C",13,1,null,0,null,0,null,0,"d3",1,"-"]
[329,"Light,Create",null,null,329,"C",13,1,null,0,null,0,null,0,"d2",1,"-"]
[330,"Light,Detach",null,null,{"$f":"A369","v":330},"C",13,1,null,0,null,0,null,0,"d3",1,"-"]
[{"$f":"A369+1","v":331},"Light,Affix",null,null,331,"C",13,1,null,0,null,0,null,0,"d3",1,"-"]
[332,"Light,Amplify",null,null,332,"C",13,1,null,0,null,0,null,0,"d3",3,"-"]
[333,"Light,Accelerate",null,null,333,"C",13,1,null,0,null,0,null,0,"d3",4,"-"]
[334,"Light,Intensify",null,null,334,"C",13,1,null,0,null,0,null,0,"d3",4,"-"]
[335,"Light,Remove",null,null,335,"C",13,1,null,0,null,0,null,0,"d2",1,"-"]
[336,"Dark,Create",null,null,336,"C",13,1,null,0,null,0,null,0,"d2",1,"-"]
[337,"Dark,Detach",null,null,337,"C",13,1,null,0,null,0,null,0,"d3",1,"-"]
[338,"Dark,Affix",null,null,338,"C",13,1,null,0,null,0,null,0,"d3",1,"-"]
[339,"Dark,Amplify",null,null,339,"C",13,1,null,0,null,0,null,0,"d3",3,"-"]
[340,"Dark,Accelerate",null,null,340,"C",13,1,null,0,null,0,null,0,"d3",4,"-"]
[341,"Dark,Intensify",null,null,341,"C",13,1,null,0,null,0,null,0,"d3",4,"-"]
[342,"Dark,Remove",null,null,342,"C",13,1,null,0,null,0,null,0,"d2",1,"-"]
[343,"Flame,Create",null,null,343,"C",13,1,null,0,null,0,null,0,"d3",2,"-"]
[344,"Flame,Detach",null,null,344,"C",13,1,null,0,null,0,null,0,"d3",2,"-"]
[345,"Flame,Affix",null,null,345,"C",13,1,null,0,null,0,null,0,"d3",2,"-"]
[346,"Flame,Amplify",null,null,346,"C",13,1,null,0,null,0,null,0,"d3",3,"-"]
[347,"Flame,Accelerate",null,null,347,"C",13,1,null,0,null,0,null,0,"d3",4,"-"]
[348,"Flame,Intensify",null,null,348,"C",13,1,null,0,null,0,null,0,"d4",5,"-"]
[349,"Flame,Remove",null,null,349,"C",13,1,null,0,null,0,null,0,"d3",2,"-"]
[350,"Fire,Create",null,null,350,"C",13,1,null,0,null,0,null,0,"d3",1,"-"]
[351,"Fire,Detach",null,null,351,"C",13,1,null,0,null,0,null,0,"d3",1,"-"]
[352,"Fire,Affix",null,null,352,"C",13,1,null,0,null,0,null,0,"d3",2,"-"]
[353,"Fire,Amplify",null,null,353,"C",13,1,null,0,null,0,null,0,"d3",4,"-"]
[354,"Fire,Accelerate",null,null,354,"C",13,1,null,0,null,0,null,0,"d3",4,"-"]
[355,"Fire,Intensify",null,null,355,"C",13,1,null,0,null,0,null,0,"d4",5,"-"]
[356,"Fire,Remove",null,null,356,"C",13,1,null,0,null,0,null,0,"d3",2,"-"]
[357,"Etheric Fire,Create",null,null,357,"C",13,1,null,0,null,0,null,0,"d1",3,"-"]
[358,"Etheric Fire,Detach",null,null,358,"C",13,1,null,0,null,0,null,0,"d2",3,"-"]
[359,"Etheric Fire,Affix",null,null,359,"C",13,1,null,0,null,0,null,0,"d2",3,"-"]
[360,"Etheric Fire,Amplify",null,null,360,"C",13,1,null,0,null,0,null,0,"d3",4,"-"]
[361,"Etheric Fire,Accelerate",null,null,361,"C",13,1,null,0,null,0,null,0,"d3",4,"-"]
[362,"Etheric Fire,Intensify",null,null,{"$f":"A401","v":362},"C",13,1,null,0,null,0,null,0,"d4",4,"-"]
[{"$f":"A401+1","v":363},"Etheric Fire,Remove",null,null,363,"C",13,1,null,0,null,0,null,0,"d1",3,"-"]
[364,"Ice,Create",null,null,364,"C",13,1,null,0,null,0,null,0,"d4",3,"-"]
[365,"Ice,Detach",null,null,365,"C",13,1,null,0,null,0,null,0,"d4",3,"-"]
[366,"Ice,Affix",null,null,366,"C",13,1,null,0,null,0,null,0,"d4",3,"-"]
[367,"Ice,Amplify",null,null,367,"C",13,1,null,0,null,0,null,0,"d6",3,"-"]
[368,"Ice,Accelerate",null,null,368,"C",13,1,null,0,null,0,null,0,"d6",3,"-"]
[369,"Ice,Intensify",null,null,369,"C",13,1,null,0,null,0,null,0,"d5",3,"-"]
[370,"Ice,Remove",null,null,370,"C",13,1,null,0,null,0,null,0,"d4",2,"-"]
[371,"Water,Create",null,null,371,"C",13,1,null,0,null,0,null,0,"d3",1,"-"]
[372,"Water,Detach",null,null,372,"C",13,1,null,0,null,0,null,0,"d4",2,"-"]
[373,"Water,Affix",null,null,373,"C",13,1,null,0,null,0,null,0,"d4",2,"-"]
[374,"Water,Amplify",null,null,374,"C",13,1,null,0,null,0,null,0,"d4",2,"-"]
[375,"Water,Accelerate",null,null,375,"C",13,1,null,0,null,0,null,0,"d6",2,"-"]
[376,"Water,Intensify",null,null,376,"C",13,1,null,0,null,0,null,0,"d5",2,"-"]
[377,"Water,Remove",null,null,377,"C",13,1,null,0,null,0,null,0,"d3",1,"-"]
[378,"Spray,Create",null,null,378,"C",13,1,null,0,null,0,null,0,"d3",1,"-"]
[379,"Spray,Detach",null,null,379,"C",13,1,null,0,null,0,null,0,"d3",1,"-"]
[380,"Spray,Affix",null,null,380,"C",13,1,null,0,null,0,null,0,"d3",1,"-"]
[381,"Spray,Amplify",null,null,381,"C",13,1,null,0,null,0,null,0,"d4",1,"-"]
[382,"Spray,Accelerate",null,null,382,"C",13,1,null,0,null,0,null,0,"d4",1,"-"]
[383,"Spray,Intensify",null,null,383,"C",13,1,null,0,null,0,null,0,"d4",1,"-"]
[384,"Spray,Remove",null,null,384,"C",13,1,null,0,null,0,null,0,"d2",1,"-"]
[385,"Mist,Create",null,null,385,"C",13,1,null,0,null,0,null,0,"d3",1,"-"]
[386,"Mist,Detach",null,null,386,"C",13,1,null,0,null,0,null,0,"d3",1,"-"]
[387,"Mist,Affix",null,null,387,"C",13,1,null,0,null,0,null,0,"d3",1,"-"]
[388,"Mist,Amplify",null,null,388,"C",13,1,null,0,null,0,null,0,"d4",1,"-"]
[389,"Mist,Accelerate",null,null,389,"C",13,1,null,0,null,0,null,0,"d4",1,"-"]
[390,"Mist,Intensify",null,null,390,"C",13,1,null,0,null,0,null,0,"d4",1,"-"]
[391,"Mist,Remove",null,null,391,"C",13,1,null,0,null,0,null,0,"d3",1,"-"]
[]
[null,"Protective Magic",{"$nulls":4},"Affinity","Plus","Affinity2","Plus2","Affinity3","Plus3","Affinity4","Plus4","Difficulty","Stamina","Save","Effect"]
[{"$f":"A430+1","v":392},"Ward Self",null,null,{"$f":"A433","v":392},"C",9,1,null,0,null,0,null,0,"Spcl","1+","-"]
[{"$f":"A433+1","v":393},"Ward Area",null,null,{"$f":"A434","v":393},"C",9,1,null,0,null,0,null,0,"Spcl","1+","-"]
[{"$f":"A434+1","v":394},"Dispel Magic",null,null,{"$f":"A435","v":394},"C",9,1,null,0,null,0,null,0,"Spcl","1+","-"]
[{"$f":"A435+1","v":395},"Circle of Protection",null,null,{"$f":"A436","v":395},"C",9,1,null,0,null,0,null,0,"Spcl","1+","-"]
[]
[null,"Therapeutic Magic",{"$nulls":4},"Affinity","Plus","Affinity2","Plus2","Affinity3","Plus3","Affinity4","Plus4","Difficulty","Stamina","Save","Effect"]
[{"$f":"A436+1","v":396},"Mend Flesh",null,null,{"$f":"A439","v":396},"C",12,1,16,2,19,2,20,2,"d2","1/5","-"]
[{"$f":"A439+1","v":397},"Restore Flesh",null,null,397,"C",12,1,16,2,19,2,20,2,"d5","2/5","-"]
[{"$f":"A440+1","v":398},"Mend Muscle",null,null,398,"C",12,1,16,2,19,2,20,2,"d3",3,"-"]
[{"$f":"A441+1","v":399},"Mend Bone",null,null,399,"C",12,1,16,2,19,2,20,2,"d3",3,"-"]
[400,"Mend Organ",null,null,400,"C",12,1,16,2,19,2,20,2,"d4",4,"-"]
[401,"Mend Blood",null,null,{"$f":"A444","v":401},"C",12,1,16,2,19,2,20,2,"Spcl",5,"-"]
[402,"Neutralize Poison",null,null,402,"C",12,1,16,2,19,2,20,2,"d4",3,"-"]
[403,"Restore Mind",null,null,{"$f":"A446","v":403},"C",12,1,16,2,19,2,20,2,"d6",4,"-"]
[404,"Regneration",null,null,{"$f":"A447","v":404},"C",12,1,16,2,19,2,20,2,"d7",7,"-"]
[]
[null,"Tramautic Magic",{"$nulls":4},"Affinity","Plus","Affinity2","Plus2","Affinity3","Plus3","Affinity4","Plus4","Difficulty","Stamina","Save","Effect"]
[{"$f":"A447+1","v":405},"Rend Flesh",null,null,{"$f":"A450","v":405},"C",9,2,19,2,null,0,null,0,"Con/5","1/5","-"]
[{"$f":"A450+1","v":406},"Consume Flesh",null,null,406,"C",9,2,19,2,null,0,null,0,"Con/2","2/5","-"]
[{"$f":"A451+1","v":407},"Craze",null,null,{"$f":"A452","v":407},"C",9,2,19,2,null,0,null,0,"Int/3",3,"-"]
[408,"Tear Muscle",null,null,408,"C",9,2,19,2,null,0,null,0,"Con/3","2/5","-"]
[409,"Break Bone",null,null,409,"C",9,2,19,2,null,0,null,0,"Con/3","2/5","-"]
[410,"Destroy Organ",null,null,410,"C",9,2,19,2,null,0,null,0,"Con/3","2/5","-"]
[411,"Destroy Bone",null,null,411,"C",9,2,19,2,null,0,null,0,"Con/2","1/1","-"]
[412,"Pain",null,null,{"$f":"A457","v":412},"C",9,2,19,2,null,0,null,0,"Con/4",4,"-"]
[413,"Slow",null,null,413,"C",9,2,19,2,null,0,null,0,"Con/5",4,"-"]
[414,"Unholy Strength",null,null,{"$f":"A459","v":414},"C",9,2,19,2,null,0,null,0,"d5",4,"-"]
[{"$f":"A459+1","v":415},"Weaken",null,null,415,"C",9,2,19,2,null,0,null,0,"Con/4",4,"-"]
[]
[{"$f":"A460+1","v":416},"Out of Range",null,null,{"$f":"A462","v":416}]

{"sheet":"Initial Skills","index":5,"n_rows":25,"n_cols":44,"rows_kept":25}
[null,"Skill Cluster Inclusion Table"]
[1,"Warrior","Light Axes",1,"Hand-to-hand",1,"Cudgels",1,"Spears",1,"Thrown Weapons",1,"Shields",1,"Dodge",1,"Berserker Rage",1,"Grapple",1,"Tackle",1,"Immobile Opponent Removal",1,"Hide in Shadows",1,"Move Silently",1,"Acrobatics",1,"Ward Self",1,"Ritual Method",1,"Chirurgery",1,"Forestry",1," ",0," ",0,null," "]
[2,"Man-at-Arms","Polearms",2,"Single Edge Blades",1,"Short Blades",2,"Hammers",2,"Self Bows",2,"Dodge",1,"Immobile Opponent Removal",1,"Grapple",1,"Tackle",1,"Acrobatics",1,"Move Silently",1,"Chirurgery",1,"Military Engineer",1," ",0," ",0," ",0," ",0," ",0," ",0," ",0,null," "]
[3,"Chivalry","Polearms",2,"Two Edge Blades",1,"Single Edge Blades",1,"Shields",2,"Crossbows",1,"Dodge",1,"Grapple",1,"Tackle",1,"Protection from Evil (M)",1,"Protection from Magic (M)",1,"Ritual Method",1,"Chirurgery",1,"Military Engineer",1,"Service",1,"Armory",1,"Riding",1," ",0," ",0," ",0," ",0,null," "]
[4,"Knight","Two Edge Blades",2,"Mounted Lance",1,"Single Edge Blades",1,"Shields",2,"Dodge",1,"Tackle",1,"Grapple",1,"Protection from Evil (M)",1,"Protection from Magic (M)",1,"Ritual Method",1,"Chirurgery",1,"Military Engineer",1,"Service",1,"Armory",1,"Riding",1,"Finance",1,"Falconry",1," ",0," ",0," ",0,null," "]
[5,"Cutpurse","Knives",1,"Hand-to-Hand",1,"Dodge",1,"Tackle",1,"Charm Person",1,"Charm Small Animal",1,"Essence Method",1,"Acrobatics",1,"Detect Noises",2,"Hide in Shadows",2,"Move Silently",1,"Pick Pocket",2,"Animal Training",1,"Dancing",1,"Bargain",1," ",0," ",0," ",0," ",0," ",0,null," "]
[6,"Thief","Knives",1,"Thrown Weapons",1,"Hand-to-Hand",1,"Grapple",1,"Dodge",1,"Gemology",1,"Chirurgery",1,"Acrobatics",1,"Detect Noises",1,"Hide in Shadows",2,"Move Silently",2,"Disarm Trap",2,"Pick Lock",2,"Backstab",1," ",0," ",0," ",0," ",0," ",0," ",0,null," "]
[7,"Assassin","Knives",2,"Eastern Hand Darts",1,"Short Blades",1,"Single Edge Blades",1,"Dodge",1,"Immobile Opponent Removal",1,"Chemistry",1,"Chirurgery",1,"Acrobatics",1,"Detect Noises",1,"Hide in Shadows",1,"Move Silently",1,"Administration of Poison",1,"Backstab",1,"Physical Torture",1,"Disarm Trap",1,"Pick Lock",1," ",0," ",0," ",0,null," "]
[8,"Primative Talent","Knives",1,"Dodge",1,"any craft skill",2,"Hide in Shadows",1,"Hold Small Animal",1,"Circle of Protection",1,"Detect Tracks",1,"Detect Direction",1,"Detect Etheric",1,"Charm Person",1,"any spell",1,"any spell",1,"any spell",1,"any spell",1,"any spell",1,"Ward Self",1,"Essence Method",1," ",0," ",0," ",0,null," "]
[9,"Hex Master","Knives",1,"Staves",1,"Dodge",1,"Mathematics",2,"Ink & Paper Making",2,"Finance",1,"coercive spell",1,"coercive spell",1,"coercive spell",1,"traumatic spell",1,"traumatic spell",1,"Circle of Protection",1,"Magic Square Method",1,"Ritual Method",1,"augury spell",1," ",0," ",0," ",0," ",0," ",0,null," "]
[10,"Enchanter","Knives",1,"Staves",1,"Dodge",1,"Language:Music",2,"Instrument Playing",2,"Dancing",1,"coercive spell",1,"coercive spell",1,"coercive spell",1,"coercive spell",1,"Circle of Protection",1,"Ward Self",1,"Enchantment Method",1,"Ritual Method",1,"augury spell",1," ",0," ",0," ",0," ",0," ",0,null," "]
[11,"Thaumaturgist","Thrown Weapons",1,"Knives",1,"Dodge",1,"Herbalism",1,"Gemology",1,"Chemistry",1,"Juggling/Foolery",1,"Metallurgy",1,"Illusion,Sight",1,"Illusion,Sound",1,"Illusion,Smell",1,"Illusion,Touch",1,"Illusion,Taste",1,"Illusion,Change",1,"Thaumaturgy Method",1,"Acrobatics",1," ",0," ",0," ",0," ",0,null," "]
[12,"Power Word","Staves",1,"Dodge",1,"language:modern",1,"language:modern",1,"language:modern",1,"language:modern",1,"language:ancient",1,"language:ancient",1,"Ink & Paper Making",1,"coercive spell",1,"coercive spell",1,"coercive spell",1,"coercive spell",1,"thereputic spell",1,"thereputic spell",1,"Circle of Protection",1,"Word Method",1,"Ritual Method",1," ",0," ",0,null," "]
[13,"Cabbalist","Staves",1,"Dodge",1,"Painting & Drawing",1,"Ink & Paper Making",1,"physical spell",1,"physical spell",1,"physical spell",1,"physical spell",1,"traumatic spell",1,"traumatic spell",1,"Circle of Protection",1,"Fly",1,"Detect Life",1,"Detect Etheric",1,"Cabal Method",1,"Ritual Method",1," ",0," ",0," ",0," ",0,null," "]
[14,"Technologist"," ",0," ",0," ",0,"Not Available at this time.",0," ",0," ",0," ",0," ",0," ",0," ",0," ",0," ",0," ",0," ",0," ",0," ",0," ",0," ",0," ",0," ",0,null," "]
[15,"Alchemist"," ",0," ",0," ",0,"Not Available at this time.",0," ",0," ",0," ",0," ",0," ",0," ",0," ",0," ",0," ",0," ",0," ",0," ",0," ",0," ",0," ",0," ",0,null," "]
[16,"Healer","Staves",1,"Dodge",1,"Chirurgery",2,"Herbalism",3,"Service",1,"thereputic spell",1,"thereputic spell",1,"thereputic spell",1,"Cure Disease (M)",1,"Heal Minor Wound (M)",1,"Prayer Method",1,"Ritual Method",1," ",0," ",0," ",0," ",0," ",0," ",0," ",0," ",0,null," "]
[17,"Friar","Staves",1,"Dodge",1,"Chirurgery",1,"Herbalism",1,"Service",3,"Agriculture",2,"Cure Disease (M)",1,"Heal Minor Wound (M)",1,"Heal Serious Wound (M)",1,"Call Food Animal (M)",1,"miraculous spell",1,"Water to Wine (M)",1,"Prayer Method",1,"Ritual Method",1,"miraculous spell",1," ",0," ",0," ",0," ",0," ",0,null," "]
[18,"Cleric","Staves",1,"Dodge",1,"Service",1,"Ink & Paper Making",1,"Language(A):Latin",1,"Cure Disease (M)",1,"Heal Minor Wound (M)",1,"Confession/Absolution (M)",1,"Recognize Evil (M)",1,"Exorcism (M)",1,"Benediction (M)",1,"Protection from Evil (M)",1,"Prayer Method",1,"Ritual Method",1,"miraculous spell",1," ",0," ",0," ",0," ",0," ",0,null," "]
[19,"Shaman","Knives",1,"Staves",1,"Self Bows",1,"Dodge",1,"Chirurgery",1,"Herbalism",1,"Forestry",1,"Agriculture",1,"Cure Disease (M)",1,"Heal Minor Wound (M)",1,"Circle of Protection",1,"Detect Damage/Disease",1,"Prayer Method",1,"Ritual Method",1,"Move Silently",1,"Detect Noises",1," ",0," ",0," ",0," ",0,null," "]
[20,"Druid","Knives",1,"Staves",1,"Dodge",1,"Chirurgery",1,"Herbalism",2,"Forestry",1,"Astronomy",1,"Mathematics",1,"Cure Disease (M)",1,"Heal Minor Wound (M)",1,"Circle of Protection",1,"Prayer Method",1,"Ritual Method",1,"Move Silently",1,"Detect Noises",1,"nature miracle",1,"nature miracle",1," ",0," ",0," ",0,null," "]
[21,"Coursair","Single Edge Blades ",1,"Guns and Crossbows",1," ",0,"Not Available at this time.",0," ",0," ",0," ",0," ",0," ",0," ",0," ",0," ",0," ",0," ",0," ",0," ",0," ",0," ",0," ",0," ",0,null," "]
[22,"Courtesan","Knives",1," ",0," ",0,"Not Available at this time.",0," ",0," ",0," ",0," ",0," ",0," ",0," ",0," ",0," ",0," ",0," ",0," ",0," ",0," ",0," ",0," ",0,null," "]
[23,"Unselected"," ",0," ",0," ",0," ",0," ",0," ",0," ",0," ",0," ",0," ",0," ",0," ",0," ",0," ",0," ",0," ",0," ",0," ",0," ",0," ",0,null," "]
[{"$nulls":32}," ",{"$nulls":3}," ",{"$nulls":3}," "]

{"sheet":"Tables","index":6,"n_rows":351,"n_cols":25,"rows_kept":351}
["Race Selection Table"]
["roll","race","IQ","WIS","CON","STR","DEX","SP","AP","ART","ETH","FAI","MAG","BOD","AGE","LE",null,"VISION"]
[2,"Pixie",null,null,-1,-1,3,-1,2,1,3,null,3,-3,30,0,1,"Normal"]
[3,"Saurig",1,null,1,null,2,-2,-1,{"$nulls":3},-1,null,10,150,2,"Normal"]
[4,"Hobbit",null,null,3,null,3,{"$nulls":3},2,null,-4,-2,30,150,3,"Night Vision"]
[5,"Dwarf",null,null,3,2,-2,-1,-2,1,-1,-2,null,2,50,300,4,"Night Vision"]
[6,"Half-Elf",null,null,2,null,1,null,1,{"$nulls":3},1,null,40,1000,5,"Normal"]
[7,"Human",{"$nulls":12},14,80,6,"Normal"]
[17,"Elf",null,null,-2,-1,3,1,1,1,1,2,2,-1,100,0,7,"Infra-Vision"]
[18,"Gnome",null,null,3,2,-2,null,-2,2,-1,{"$nulls":3},55,330,8,"Normal"]
[19,"Half-Orc",null,null,2,1,null,null,-1,null,-1,-2,null,1,16,500,9,"Night Vision"]
[20,"Centaur",null,-1,3,2,-2,null,null,-1,2,-2,-2,4,15,500,10,"Normal"]
[21,"Kobold",-2,-1,1,-1,3,-1,-2,1,3,null,null,-3,12,45,11]
[22,"Orc",-2,-1,3,3,1,-2,-3,-1,-2,-2,-2,3,15,500,12]
[23,"Goblin",-1,null,2,2,2,-2,-2,-1,null,2,1,null,15,75,13]
[24,"Urikhai",null,null,4,4,2,-1,-2,-1,-3,null,null,5,18,500,14]
[25,"Skeleton",null,null,2,null,1,null,1,{"$nulls":3},1,null,0,0,15]
[26,"Skeleton2",{"$nulls":12},0,0,16]
[27,{"$nulls":3},-2,-1,3,1,1,1,1,2,2,-1,0,0,17]
[28,{"$nulls":3},3,2,-2,null,-2,2,-1,{"$nulls":3},0,0,18]
[29,"Demon Major",3,null,4,4,2,-2,-4,null,-10,-10,4,25,0,1000,19]
[30,"Dragon",5,4,5,8,-2,2,-2,-1,null,-2,5,75,500,2500,20]
[]
["Racial Size Table (Stature)"]
["RACE",-1,0,1,2,3,4,5,6,7,8,9,10,11,12,13,14,15,16,17,18,19,20,21,22]
["Pixie",{"$nulls":3},15,15,16,16,17,17,17,18,18,18,19,19,20,20,20,21,21,21,24]
[null,7,8,9,10,11,12,13,14,15,16,17,18,19,19,20,21,22,23,24,25,26,27,28,30]
["Saurig",{"$nulls":3},60,61,62,63,64,65,66,67,68,69,70,71,72,73,74,75,76,77,84]
[null,100,106,113,119,125,131,138,144,150,156,163,169,175,181,188,194,200,206,213,219,225,231,238,250]
["Hobbit",{"$nulls":3},43,44,44,45,45,46,47,47,48,48,49,49,50,51,51,52,52,53,57]
[null,50,53,56,59,63,66,69,72,75,78,81,84,88,91,94,97,100,103,106,109,113,116,119,125]
["Dwarf",{"$nulls":3},45,46,46,47,48,48,49,50,50,51,52,52,53,54,54,55,56,56,61]
[null,60,65,69,74,78,83,87,92,97,101,106,110,115,120,124,129,133,138,142,147,152,156,161,170]
["Half-Elf",{"$nulls":3},60,61,62,63,64,65,66,67,68,69,70,71,72,73,74,75,76,77,84]
[null,70,76,83,89,95,101,108,114,120,126,133,139,145,151,158,164,170,176,183,189,195,201,208,220]
["Men",{"$nulls":3},55,56,57,59,60,61,62,63,65,66,67,68,70,71,72,73,74,76,84]
[null,70,78,85,93,100,108,115,123,130,138,145,153,160,168,175,183,190,198,205,213,220,228,235,250]
["Elf",{"$nulls":3},54,55,56,57,58,59,60,61,62,63,64,65,66,66,67,68,69,70,77]
[null,65,72,80,87,94,101,109,116,123,131,138,145,153,160,167,174,182,189,196,204,211,218,225,240]
["Gnome",{"$nulls":3},45,46,46,47,48,48,49,50,50,51,52,52,53,54,54,55,56,56,61]
[null,60,64,68,71,75,79,83,86,90,94,98,101,105,109,113,116,120,124,128,131,135,139,143,150]
["Half-Orc",{"$nulls":3},54,55,56,57,57,58,59,60,61,62,62,63,64,65,66,67,67,68,74]
[null,75,88,100,113,125,138,150,163,175,188,200,213,225,238,250,263,275,288,300,313,325,338,350,375]
["Centaur",{"$nulls":3},72,74,76,78,80,82,84,86,88,90,92,94,96,98,100,102,104,106,120]
[null,1000,1042,1083,1125,1167,1208,1250,1292,1333,1375,1417,1458,1500,1542,1583,1625,1667,1708,1750,1792,1833,1875,1917,2000]
["Kobold",{"$nulls":3},15,15,16,16,17,17,17,18,18,18,19,19,20,20,20,21,21,21,24]
[null,7,8,9,10,11,12,13,14,15,16,17,18,19,19,20,21,22,23,24,25,26,27,28,30]
["Orc",{"$nulls":3},54,55,56,57,57,58,59,60,61,62,62,63,64,65,66,67,67,68,74]
[null,100,106,113,119,125,131,138,144,150,156,163,169,175,181,188,194,200,206,213,219,225,231,238,250]
["Goblin",{"$nulls":3},43,44,44,45,45,46,47,47,48,48,49,49,50,51,51,52,52,53,57]
[null,50,53,56,59,63,66,69,72,75,78,81,84,88,91,94,97,100,103,106,109,113,116,119,125]
["Urikhai",{"$nulls":3},60,62,64,66,68,70,72,74,76,78,80,82,84,86,88,90,92,94,96]
[null,105,{"$f":"B53+5","v":110},{"$f":"C53+5","v":115},120,125,130,135,140,145,150,155,160,165,170,175,180,185,190,195,200,205,210,215,220]
["Skeleton",{"$nulls":3},60,61,62,63,64,65,66,67,68,69,70,71,72,73,74,75,76,77,84]
[null,70,76,83,89,95,101,108,114,120,126,133,139,145,151,158,164,170,176,183,189,195,201,208,220]
["Skeleton2",{"$nulls":3},55,56,57,59,60,61,62,63,65,66,67,68,70,71,72,73,74,76,84]
[null,70,78,85,93,100,108,115,123,130,138,145,153,160,168,175,183,190,198,205,213,220,228,235,250]
["x",{"$nulls":3},54,55,56,57,58,59,60,61,62,63,64,65,66,66,67,68,69,70,77]
[null,65,72,80,87,94,101,109,116,123,131,138,145,153,160,167,174,182,189,196,204,211,218,225,240]
["x",{"$nulls":3},45,46,46,47,48,48,49,50,50,51,52,52,53,54,54,55,56,56,61]
[null,60,64,68,71,75,79,83,86,90,94,98,101,105,109,113,116,120,124,128,131,135,139,143,150]
["Demon Major",{"$nulls":3},400,400,400,400,400,400,400,400,400,400,400,400,400,400,400,400,400,400,400]
[null,400,400,400,400,400,400,400,400,400,400,400,400,400,400,400,400,400,400,400,400,400,400,400,400]
["Dragon",{"$nulls":3},100,105,110,115,120,125,130,135,140,145,150,155,160,165,170,175,180,185,190]
[null,1500,1750,2000,2250,2500,2750,3000,3250,3500,3750,4000,4250,4500,4750,5000,5250,5500,5750,6000,6250,6500,6750,7000,7250]
["BODY",-2,-2,-1,-1,0,0,0,0,0,0,0,0,0,1,1,2,3,4,5,6,7,8,9,10]
[]
["Build Modifications Table"]
[null,1,2,4,8,10]
["male",-2,-1,null,1,2]
["female",-3,-2,-1,null,1]
[]
["Horoscope Table"]
["roll","zodiac","IQ","WIS","CON","STR","DEX","SP","AP","ART","ETH","FAI"]
[1,"Aries",{"$nulls":4},2,1,1]
[11,"Taurus",null,null,2,{"$nulls":5},2]
[19,"Gemini",2,{"$nulls":4},2]
[26,"Cancer",null,null,2,{"$nulls":4},1,null,1]
[33,"Leo",null,null,1,3]
[41,"Virgo",null,1,{"$nulls":4},2,null,1]
[49,"Libra",null,2,{"$nulls":5},1,null,1]
[57,"Scorpio",3,{"$nulls":6},1]
[66,"Sagittarius",null,2,null,2]
[73,"Capricorn",null,null,1,null,1,null,2]
[81,"Aquarius",null,null,1,{"$nulls":4},1,1,1]
[89,"Pisces",{"$nulls":3},1,2,null,null,1]
[]
["Racial Characteristics"]
["Index","Characteristic",null,null,"Int","Wis","Con","Str","Dex","Spe","App","Art","Eth","Fat","Bod","Sta","Com","Ste","Mag","Mir"]
[1,"Infravision",null,{"$f":"A90","v":1},{"$nulls":12},1,2]
[{"$f":"A90+1","v":2},"Night Vision",null,{"$f":"A91","v":2},{"$nulls":12},1,2]
[{"$f":"A91+1","v":3},"Far Sight",null,3,{"$nulls":12},2]
[4,"Blind",null,4,{"$nulls":6},-1,{"$nulls":5},-10,-10]
[5,null,null,5]
[6,null,null,6]
[7,null,null,7]
[8,null,null,8]
[]
["Skill Class / Age Table"]
["Skill C","Age Cost"]
[1,2]
[2,4]
[3,8]
[4,15]
[5,2]
[6,4]
[7,10]
[8,0]
[9,5]
[10,4]
[11,8]
[12,10]
[13,7]
[14," "]
[15," "]
[{"$f":"A115+1","v":16},7]
[17,3]
[18,5]
[19,10]
[20,8]
[21]
[22]
[23]
[]
["Starting Skill Bonus Table"]
[0,50,25]
[6,100,50]
[10,150,100]
[15,200,125]
[17,250,150]
[19,275,175]
[20,300,200]
[]
["Combat Bonus Tables"]
["Axes",{"$f":"CONCATENATE(A135,C135)","v":"Axes0"},0,0]
["Axes","Axes10",10,1]
["Axes","Axes13",13,2]
["Axes","Axes17",17,3]
["Axes","Axes23",23,4]
["Axes","Axes30",30,5]
["Axes","Axes34",34,6]
["Axes","Axes40",40,7]
["Axes","Axes50",50,8]
["Cudgels","Cudgels0",0,0]
["Cudgels","Cudgels10",10,1]
["Cudgels","Cudgels13",13,2]
["Cudgels","Cudgels17",17,3]
["Cudgels","Cudgels23",23,4]
["Cudgels","Cudgels30",30,5]
["Cudgels","Cudgels34",34,6]
["Cudgels","Cudgels40",40,7]
["Cudgels","Cudgels50",50,8]
["Flails",{"$f":"CONCATENATE(A153,C153)","v":"Flails0"},0,0]
["Flails","Flails10",10,1]
["Flails","Flails17",17,2]
["Flails","Flails23",23,3]
["Flails","Flails30",30,4]
["Flails","Flails37",37,5]
["Flails","Flails45",45,6]
["Foil","Foil0",0,0]
["Foil","Foil10",10,1]
["Foil","Foil13",13,2]
["Foil","Foil17",17,3]
["Foil","Foil23",23,4]
["Foil","Foil30",30,5]
["Foil","Foil34",34,6]
["Foil","Foil40",40,7]
["Foil","Foil50",50,8]
["Hammers","Hammers0",0,0]
["Hammers","Hammers10",10,1]
["Hammers","Hammers17",17,2]
["Hammers","Hammers23",23,3]
["Hammers",{"$f":"CONCATENATE(A173,C173)","v":"Hammers30"},30,4]
["Hammers","Hammers37",37,5]
["Hammers","Hammers45",45,6]
["Hand-to-Hand","Hand-to-Hand0",0,0]
["Hand-to-Hand","Hand-to-Hand10",10,1]
["Hand-to-Hand",{"$f":"CONCATENATE(A178,C178)","v":"Hand-to-Hand13"},13,2]
["Hand-to-Hand","Hand-to-Hand17",17,3]
["Hand-to-Hand","Hand-to-Hand23",23,4]
["Hand-to-Hand","Hand-to-Hand30",30,5]
["Hand-to-Hand","Hand-to-Hand34",34,6]
["Hand-to-Hand","Hand-to-Hand40",40,7]
["Hand-to-Hand","Hand-to-Hand50",50,8]
["Knives","Knives0",0,0]
["Knives","Knives10",10,1]
["Knives","Knives13",13,2]
["Knives","Knives17",17,3]
["Knives","Knives23",23,4]
["Knives","Knives30",30,5]
["Knives","Knives34",34,6]
["Knives","Knives40",40,7]
["Knives","Knives50",50,8]
["Light Axes","Light Axes0",0,0]
["Light Axes","Light Axes10",10,1]
["Light Axes","Light Axes13",13,2]
["Light Axes","Light Axes17",17,3]
["Light Axes","Light Axes23",23,4]
["Light Axes","Light Axes30",30,5]
["Light Axes","Light Axes34",34,6]
["Light Axes","Light Axes40",40,7]
["Light Axes","Light Axes50",50,8]
["Mounted Lance","Mounted Lance0",0,0]
["Polearms",{"$f":"CONCATENATE(A204,C204)","v":"Polearms0"},0,0]
["Polearms","Polearms11",11,1]
["Polearms","Polearms17",17,2]
["Polearms","Polearms23",23,3]
["Polearms","Polearms30",30,4]
["Polearms","Polearms37",37,5]
["Polearms","Polearms45",45,6]
["Shields",{"$f":"CONCATENATE(A211,C211)","v":"Shields0"},0,0]
["Shields","Shields11",11,1]
["Shields","Shields17",17,2]
["Shields","Shields23",23,3]
["Shields","Shields30",30,4]
["Shields","Shields37",37,5]
["Shields","Shields45",45,6]
["Short Blades","Short Blades0",0,0]
["Short Blades","Short Blades10",10,1]
["Short Blades","Short Blades13",13,2]
["Short Blades","Short Blades17",17,3]
["Short Blades","Short Blades23",23,4]
["Short Blades","Short Blades30",30,5]
["Short Blades","Short Blades34",34,6]
["Short Blades","Short Blades40",40,7]
["Short Blades","Short Blades50",50,8]
["Single Edge Blades","Single Edge Blades0",0,0]
["Single Edge Blades","Single Edge Blades10",10,1]
["Single Edge Blades","Single Edge Blades13",13,2]
["Single Edge Blades","Single Edge Blades17",17,3]
["Single Edge Blades","Single Edge Blades23",23,4]
["Single Edge Blades",{"$f":"CONCATENATE(A232,C232)","v":"Single Edge Blades30"},30,5]
["Single Edge Blades","Single Edge Blades34",34,6]
["Single Edge Blades","Single Edge Blades40",40,7]
["Single Edge Blades","Single Edge Blades50",50,8]
["Spears","Spears0",0,0]
["Spears","Spears10",10,1]
["Spears","Spears13",13,2]
["Spears","Spears17",17,3]
["Spears","Spears23",23,4]
["Spears","Spears30",30,5]
["Spears","Spears34",34,6]
["Spears","Spears40",40,7]
["Spears","Spears50",50,8]
["Staves","Staves0",0,0]
["Staves","Staves10",10,1]
["Staves","Staves13",13,2]
["Staves","Staves17",17,3]
["Staves","Staves23",23,4]
["Staves","Staves30",30,5]
["Staves","Staves34",34,6]
["Staves","Staves40",40,7]
["Staves","Staves50",50,8]
["Two Edge Blades","Two Edge Blades0",0,0]
["Two Edge Blades","Two Edge Blades11",11,1]
["Two Edge Blades","Two Edge Blades17",17,2]
["Two Edge Blades","Two Edge Blades23",23,3]
["Two Edge Blades","Two Edge Blades30",30,4]
["Two Edge Blades","Two Edge Blades37",37,5]
["Two Edge Blades","Two Edge Blades45",45,6]
["Whips","Whips0",0,0]
["Whips","Whips11",11,1]
["Whips","Whips17",17,2]
["Whips",{"$f":"CONCATENATE(A264,C264)","v":"Whips23"},23,3]
["Whips",{"$f":"CONCATENATE(A265,C265)","v":"Whips30"},30,4]
["Whips",{"$f":"CONCATENATE(A266,C266)","v":"Whips37"},37,5]
["Whips",{"$f":"CONCATENATE(A267,C267)","v":"Whips45"},45,6]
[]
["Missle Combat Bonus Table"]
["Bolo",{"$f":"CONCATENATE(A270,C270)","v":"Bolo0"},0,0]
["Bolo","Bolo15",15,1]
["Bolo","Bolo19",19,2]
["Crossbows","Crossbows0",0,0]
["Eastern Hand Darts","Eastern Hand Darts0",0,0]
["Eastern Hand Darts","Eastern Hand Darts15",15,1]
["Eastern Hand Darts","Eastern Hand Darts19",19,2]
["Guns","Guns0",0,0]
["Self Bows","Self Bows0",0,0]
["Self Bows","Self Bows15",15,1]
["Self Bows","Self Bows19",19,2]
["Thrown Weapons","Thrown Weapons0",0,0]
["Thrown Weapons","Thrown Weapons15",15,1]
["Thrown Weapons","Thrown Weapons19",19,2]
[]
["Encumberance Table"]
[null,"Tests","Tests","Attacks","Attacks","Combat","Travel"]
["% Enc","By","Against","By","Against","Fatigue","Fatigue"]
[0,null,null,"+5",null,".5/turn","1/hour"]
[10,null,null,"+5",null,".5/turn","1/hour"]
[40,{"$nulls":4},"1/turn","2/hour"]
[75,null,"-1D",-5,"+10","2/turn","3/hour"]
[90,"+1D","-2D",-15,"+25","3/turn","4/hour"]
[100,"+2D","-2D",-25,"+50","5/turn","1/min"]
[]
["Stamina / Body Recovery Table"]
["Con","S-Walk","S-Rest","S-Sleep","B-Walk","B-Rest","B-Sleep"]
[1,0,2,3,-1,0,0]
[2,0,2,3,-1,0,0]
[4,0,2,4,-1,0,0]
[6,1,3,5,-1,0,0]
[9,1,3,5,-1,0,1]
[11,1,4,6,0,0,1]
[13,2,5,7,0,0,1]
[15,2,5,7,0,0,1]
[16,2,5,8,0,1,2]
[17,2,5,8,0,1,2]
[18,3,6,9,1,2,3]
[19,3,6,9,1,2,3]
[20,4,8,12,1,3,4]
["Stamina is recovered per hour when Walking / Resting / Sleeping"]
["Body is recoverd per day when at Strenuous Activity / Moderate Activity / Resting"]
[]
[]
["Social Status Table"]
[]
["roll","Status"]
[2,"Slave"]
[3,"Serf"]
[4,"Bastard"]
[6,"Yeoman"]
[11,"Townsman"]
[15,"Guildsman"]
[18,"Knight"]
[19,"Noble"]
[20,"Royal"]
[]
[]
[]
["Skill Cluster Codes"]
[7,"Assassin",7]
[13,"Cabbalist",13]
[3,"Chivalry",3]
[18,"Cleric",18]
[5,"Cutpurse",5]
[20,"Druid",20]
[10,"Enchanter",10]
[17,"Friar",17]
[16,"Healer",16]
[9,"Hex Master",9]
[4,"Knight",4]
[2,"Man-at-Arms",2]
[12,"Power Word Mage",12]
[8,"Primitive Talent Mage",8]
[19,"Shaman",19]
[11,"Thaumaturgist",11]
[6,"Thief",6]
[1,"Warrior",1]
[14,"Technologist (Unavailable)",14]
[15,"Alchemist (Unavailable)",15]
[21,"Corsair (Unavailable)",21]
[22,"Courtesan (Unavailable)",22]

{"sheet":"Choosers","index":7,"n_rows":65,"n_cols":8,"rows_kept":65}
[]
["Axes","Axes","Battle Axe",null,null,"Crossbows","Crossbows","Light Crossbow"]
["Cudgels","Axes","Norman War Axe",null,null,"Eastern Hand Darts","Crossbows","Thieves Crossbow"]
["Flails","Axes","Woodsman's Axe",null,null,"Self Bows","Crossbows","Heavy Crossbow"]
["Foil","Axes","Halberd",null,null,"Thrown Weapons","Eastern Hand Darts","Small Blowgun"]
["Hammers","Axes","Two-Handed Battle Axe",null,null,"All Missile Weapons","Eastern Hand Darts","Large Blowgun"]
["Knives","Cudgels","Light Club",{"$nulls":3},"Eastern Hand Darts","Chakra"]
["Light Axes","Cudgels","Cudgel",{"$nulls":3},"Self Bows","Shortbow"]
["Lance","Cudgels","War Pick",{"$nulls":3},"Self Bows","Longbow"]
["Polearms","Cudgels","Heavy Club",{"$nulls":3},"Self Bows","Composite bow"]
["Short Blades","Cudgels","Mace",{"$nulls":3},"Self Bows","Elvish Longbow"]
["Single Edge Blades","Flails","Flail",{"$nulls":3},"Thrown Weapons","Hand Sling"]
["Spears","Flails","Morning Star",{"$nulls":3},"Thrown Weapons","Staff Sling"]
["Staves","Flails","Two-Handed Flail",{"$nulls":3},"Thrown Weapons","Dart"]
["Net","Foil","Foil",{"$nulls":3},"Thrown Weapons","Rock"]
["Two Edge Blades","Hammers","Dwarvish Warhammer",{"$nulls":3},"Thrown Weapons","Bolo"]
["Whips","Hammers","Warhammer",{"$nulls":3},"Thrown Weapons","Throwing Knife"]
["All Weapons","Hammers","Maul",{"$nulls":3},"Thrown Weapons","Throwing Axe"]
[null,"Hammers","Two-Handed Warhammer",{"$nulls":3},"Thrown Weapons","Spear"]
[null,"Knives","Dagger",{"$nulls":3},"Thrown Weapons","Javelin"]
[null,"Knives","Knife"]
[null,"Knives","Sickle"]
[null,"LightAxes","Hatchet"]
[null,"LightAxes","Light Axe",null,null,"All Missile Weapons"]
[null,"LightAxes","Tomahawk",{"$nulls":3},"Light Crossbow"]
[null,"Lance","Jousting Lance"]
[null,"Lance","Combat Lance"]
[null,"Polearms","Pitchfork"]
[null,"Polearms","Conteux de Breche"]
[null,"Polearms","Fauchard"]
[null,"Polearms","Fauchard Fork"]
[null,"Polearms","Guisarme/Bill"]
[null,"Polearms","Lucerne Hammer"]
[null,"Polearms","Partisan"]
[null,"Polearms","Long Pike"]
[null,"Polearms","Normal Pike"]
[null,"Polearms","Short Pike"]
[null,"Polearms","Spontoon"]
[null,"Polearms","Footman's Lance"]
[null,"Polearms","Voulge"]
[null,"Polearms","War Scythe"]
[null,"ShortBlades","Light Sword"]
[null,"ShortBlades","Rapier"]
[null,"ShortBlades","Short Sword"]
[null,"SingleEdgeBlades","Cutlass"]
[null,"SingleEdgeBlades","Saber"]
[null,"SingleEdgeBlades","Longsword"]
[null,"SingleEdgeBlades","Normal Sword"]
[null,"SingleEdgeBlades","Scimitar"]
[null,"SingleEdgeBlades","Scimitar (Goblinoid)"]
[null,"SingleEdgeBlades","Two-Handed Sword"]
[null,"Spears","Javelin (thrust)"]
[null,"Spears","Hunting Spear"]
[null,"Spears","Long Spear"]
[null,"Spears","Normal Spear"]
[null,"Staves","Staff"]
[null,"Staves","Quarterstaff"]
[null,"Staves","Ironshod Quarterstaff"]
[null,"Net","Net"]
[null,"TwoEdgeBlades","Bastard Sword"]
[null,"TwoEdgeBlades","Broadsword"]
[null,"TwoEdgeBlades","Hand-and-a-half Sword"]
[null,"TwoEdgeBlades","Two-Handed Broadsword"]
[null,"Whips","Bullwhip"]
[null,"Whips","Whipknife"]

{"sheet":"Crunch","index":8,"n_rows":39,"n_cols":16,"rows_kept":39}
[{"$f":"B1&C1&D1&E1&F1&G1&H1","v":"|Intelligence |={border:1px dashed blue}.5||Charisma |={border:1px dashed green}.10||Stealth |={border:1px solid black}.16|"},"|Intelligence |={border:1px dashed blue}.",{"$f":"Frontsheet!E3","v":5},"||Charisma |={border:1px dashed green}.",{"$f":"Frontsheet!E14","v":10},"||Stealth |={border:1px solid black}.",{"$f":"Frontsheet!E9","v":16},"|"]
["|Wisdom |={border:1px dashed blue}.15||Charm |={border:1px dashed green}.11||Combat |={border:1px solid black}.16|","|Wisdom |={border:1px dashed blue}.",{"$f":"Frontsheet!E4","v":15},"||Charm |={border:1px dashed green}.",{"$f":"Frontsheet!E15","v":11},"||Combat |={border:1px solid black}.",{"$f":"Frontsheet!E10","v":16},"|"]
["|Constitution |={border:1px dashed blue}.5||Stamina |={border:1px solid black}.4||Magic |={border:1px solid black}.10|","|Constitution |={border:1px dashed blue}.",{"$f":"Frontsheet!E5","v":5},"||Stamina |={border:1px solid black}.",{"$f":"Frontsheet!E16","v":4},"||Magic |={border:1px solid black}.",{"$f":"Frontsheet!E11","v":10},"|"]
["|Strength |={border:1px dashed blue}.16||Vigor |={border:1px solid black}.4||Miracle |={border:1px solid black}.14|","|Strength |={border:1px dashed blue}.",{"$f":"Frontsheet!E6","v":16},"||Vigor |={border:1px solid black}.",{"$f":"Frontsheet!E18","v":4},"||Miracle |={border:1px solid black}.",{"$f":"Frontsheet!E12","v":14},"|"]
["|Dexterity |={border:1px dashed blue}.22||Body |={border:1px solid black}.11||Armor Class |={border:1px dashed blue}.6(0)|","|Dexterity |={border:1px dashed blue}.",{"$f":"Frontsheet!E7","v":22},"||Body |={border:1px solid black}.",{"$f":"Frontsheet!E17","v":11},"||Armor Class |={border:1px dashed blue}.",{"$f":"CONCATENATE(-VALUE(Frontsheet!E31),IF(Frontsheet!E32>0,Frontsheet!E32,\"\"))","v":"6(0)"},"|"]
["|_\\2.*Human*||_\\2.*Male*||Speech |=.12|","|_\\2.*",{"$f":"Frontsheet!Q4","v":"Human"},"*||_\\2.*",{"$f":"Frontsheet!Q3","v":"Male"},"*||Speech |=.",{"$f":"Frontsheet!K3","v":12},"|"]
["|\\2.5 ft 8 in tall||\\2.190 lbs||Appearance |=.11|",{"$f":"\"|\\2.\"&Frontsheet!J9&\" ft \"&Frontsheet!K9&\" in tall\"","v":"|\\2.5 ft 8 in tall"},null,{"$f":"\"||\\2.\"&Frontsheet!J10&\" lbs\"","v":"||\\2.190 lbs"},null,"||Appearance |=.",{"$f":"Frontsheet!K4","v":11},"|"]
["|\\2.29 years of age||\\2.able to carry 314 lbs||Art |=.6|",{"$f":"\"|\\2.\"&Frontsheet!J12&\" years of age\"","v":"|\\2.29 years of age"},null,{"$f":"\"||\\2.able to carry \"&Frontsheet!J11&\" lbs\"","v":"||\\2.able to carry 314 lbs"},null,"||Art |=.",{"$f":"Frontsheet!K5","v":6},"|"]
["|\\5.A Townsman born in the sign of Pisces||Ethics |=.2|","|\\5.A ",{"$f":"Frontsheet!Q7","v":"Townsman"}," born in the sign of ",{"$f":"Frontsheet!Q6","v":"Pisces"},"||Ethics |=.",{"$f":"Frontsheet!K6","v":2},"|"]
["|\\5.Generally trained as a *Knight*||Faith |=.8|",{"$f":"\"|\\5.Generally trained as a *\"&Frontsheet!E20&\"*\"","v":"|\\5.Generally trained as a *Knight*"},{"$nulls":3},"||Faith |=.",{"$f":"Frontsheet!K7","v":8},"|"]
[]
[{"$f":"IF(B12=\"\",\"\",CONCATENATE(\"|_.\",B12,\"|_=.\",C12,\"|_=.Init|_=.\",E12,\"|_=.\",F12,\"|_=.\",G12,\"|_=.\",H12,\"|_=.\",I12,\"|_=.\",J12,\"|_=.\",K12,\"|_=.\",L12,\"|_=.\",M12,\"|_=.\",N12,\"|_=.\",O12,\"|_.Damage|\"))","v":"|_.Melee Weapons|_=.#B|_=.Init|_=.0|_=.1|_=.2|_=.3|_=.4|_=.5|_=.6|_=.7|_=.8|_=.9|_=.10|_.Damage|"},{"$f":"Frontsheet!A38","v":"Melee Weapons"},{"$f":"Frontsheet!F38","v":"#B"},{"$f":"Frontsheet!G38","v":"Int"},{"$f":"Frontsheet!H38","v":0},{"$f":"Frontsheet!I38","v":1},{"$f":"Frontsheet!J38","v":2},{"$f":"Frontsheet!K38","v":3},{"$f":"Frontsheet!L38","v":4},{"$f":"Frontsheet!M38","v":5},{"$f":"Frontsheet!N38","v":6},{"$f":"Frontsheet!O38","v":7},{"$f":"Frontsheet!P38","v":8},{"$f":"Frontsheet!Q38","v":9},{"$f":"Frontsheet!R38","v":10},{"$f":"Frontsheet!S38","v":"Dam"}]
[{"$f":"IF(B13=\"\",\"\",CONCATENATE(\"|.\",B13,\"|=.\",C13,\"|=.\",D13,\"|=.\",E13,\"|=.\",F13,\"|=.\",G13,\"|=.\",H13,\"|=.\",I13,\"|=.\",J13,\"|=.\",K13,\"|=.\",L13,\"|=.\",M13,\"|=.\",N13,\"|=.\",O13,\"|\",P13&\"|\"))","v":"|.Short Sword|=.3|=.25|=.30|=.25|=.20|=.10|=.0|=.-5|=.-10|=.-15|=.-15|=.-20|=.-25|2d6|"},{"$f":"Frontsheet!A39","v":"Short Sword"},{"$f":"Frontsheet!F39","v":3},{"$f":"Frontsheet!G39","v":25},{"$f":"Frontsheet!H39","v":30},{"$f":"Frontsheet!I39","v":25},{"$f":"Frontsheet!J39","v":20},{"$f":"Frontsheet!K39","v":10},{"$f":"Frontsheet!L39","v":0},{"$f":"Frontsheet!M39","v":-5},{"$f":"Frontsheet!N39","v":-10},{"$f":"Frontsheet!O39","v":-15},{"$f":"Frontsheet!P39","v":-15},{"$f":"Frontsheet!Q39","v":-20},{"$f":"Frontsheet!R39","v":-25},{"$f":"Frontsheet!S39","v":"2d6"}]
["|.Warhammer|=.3|=.27|=.15|=.15|=.15|=.10|=.10|=.10|=.5|=.5|=.0|=.-5|=.-10|2d6|",{"$f":"Frontsheet!A40","v":"Warhammer"},{"$f":"Frontsheet!F40","v":3},{"$f":"Frontsheet!G40","v":27},{"$f":"Frontsheet!H40","v":15},{"$f":"Frontsheet!I40","v":15},{"$f":"Frontsheet!J40","v":15},{"$f":"Frontsheet!K40","v":10},{"$f":"Frontsheet!L40","v":10},{"$f":"Frontsheet!M40","v":10},{"$f":"Frontsheet!N40","v":5},{"$f":"Frontsheet!O40","v":5},{"$f":"Frontsheet!P40","v":0},{"$f":"Frontsheet!Q40","v":-5},{"$f":"Frontsheet!R40","v":-10},{"$f":"Frontsheet!S40","v":"2d6"}]
["|.Maul|=.2|=.30|=.20|=.20|=.20|=.20|=.20|=.25|=.20|=.15|=.10|=.5|=.-10|2d10|",{"$f":"Frontsheet!A41","v":"Maul"},{"$f":"Frontsheet!F41","v":2},{"$f":"Frontsheet!G41","v":30},{"$f":"Frontsheet!H41","v":20},{"$f":"Frontsheet!I41","v":20},{"$f":"Frontsheet!J41","v":20},{"$f":"Frontsheet!K41","v":20},{"$f":"Frontsheet!L41","v":20},{"$f":"Frontsheet!M41","v":25},{"$f":"Frontsheet!N41","v":20},{"$f":"Frontsheet!O41","v":15},{"$f":"Frontsheet!P41","v":10},{"$f":"Frontsheet!Q41","v":5},{"$f":"Frontsheet!R41","v":-10},{"$f":"Frontsheet!S41","v":"2d10"}]
["|.Two-Handed Warhammer|=.2|=.28|=.30|=.20|=.20|=.20|=.20|=.20|=.20|=.15|=.5|=.0|=.-5|2d10|",{"$f":"Frontsheet!A42","v":"Two-Handed Warhammer"},{"$f":"Frontsheet!F42","v":2},{"$f":"Frontsheet!G42","v":28},{"$f":"Frontsheet!H42","v":30},{"$f":"Frontsheet!I42","v":20},{"$f":"Frontsheet!J42","v":20},{"$f":"Frontsheet!K42","v":20},{"$f":"Frontsheet!L42","v":20},{"$f":"Frontsheet!M42","v":20},{"$f":"Frontsheet!N42","v":20},{"$f":"Frontsheet!O42","v":15},{"$f":"Frontsheet!P42","v":5},{"$f":"Frontsheet!Q42","v":0},{"$f":"Frontsheet!R42","v":-5},{"$f":"Frontsheet!S42","v":"2d10"}]
["|.Maul|=.2|=.30|=.20|=.20|=.20|=.20|=.20|=.25|=.20|=.15|=.10|=.5|=.-10|2d10|",{"$f":"Frontsheet!A43","v":"Maul"},{"$f":"Frontsheet!F43","v":2},{"$f":"Frontsheet!G43","v":30},{"$f":"Frontsheet!H43","v":20},{"$f":"Frontsheet!I43","v":20},{"$f":"Frontsheet!J43","v":20},{"$f":"Frontsheet!K43","v":20},{"$f":"Frontsheet!L43","v":20},{"$f":"Frontsheet!M43","v":25},{"$f":"Frontsheet!N43","v":20},{"$f":"Frontsheet!O43","v":15},{"$f":"Frontsheet!P43","v":10},{"$f":"Frontsheet!Q43","v":5},{"$f":"Frontsheet!R43","v":-10},{"$f":"Frontsheet!S43","v":"2d10"}]
["|.Knife|=.4|=.23.5|=.20|=.10|=.5|=.0|=.-5|=.-10|=.-15|=.-20|=.-20|=.-25|=.-30|1d6|",{"$f":"Frontsheet!A44","v":"Knife"},{"$f":"Frontsheet!F44","v":4},{"$f":"Frontsheet!G44","v":23.5},{"$f":"Frontsheet!H44","v":20},{"$f":"Frontsheet!I44","v":10},{"$f":"Frontsheet!J44","v":5},{"$f":"Frontsheet!K44","v":0},{"$f":"Frontsheet!L44","v":-5},{"$f":"Frontsheet!M44","v":-10},{"$f":"Frontsheet!N44","v":-15},{"$f":"Frontsheet!O44","v":-20},{"$f":"Frontsheet!P44","v":-20},{"$f":"Frontsheet!Q44","v":-25},{"$f":"Frontsheet!R44","v":-30},{"$f":"Frontsheet!S44","v":"1d6"}]
[{"$f":"IF(B19=\"\",\"\",CONCATENATE(\"|_.\",B19,\"|_=.\",C19,\"|_=.Init|_=.\",E19,\"|_=.\",F19,\"|_=.\",G19,\"|_=.\",H19,\"|_=.\",I19,\"|_=.\",J19,\"|_=.\",K19,\"|_=.\",L19,\"|_=.\",M19,\"|_=.\",N19,\"|_=.\",O19,\"|_.Damage|\"))","v":"|_.Shield Weapon|_=.#B|_=.Init|_=.0|_=.1|_=.2|_=.3|_=.4|_=.5|_=.6|_=.7|_=.8|_=.9|_=.10|_.Damage|"},{"$f":"Frontsheet!A46","v":"Shield Weapon"},{"$f":"Frontsheet!F46","v":"#B"},{"$f":"Frontsheet!G46","v":"Int"},{"$f":"Frontsheet!H46","v":0},{"$f":"Frontsheet!I46","v":1},{"$f":"Frontsheet!J46","v":2},{"$f":"Frontsheet!K46","v":3},{"$f":"Frontsheet!L46","v":4},{"$f":"Frontsheet!M46","v":5},{"$f":"Frontsheet!N46","v":6},{"$f":"Frontsheet!O46","v":7},{"$f":"Frontsheet!P46","v":8},{"$f":"Frontsheet!Q46","v":9},{"$f":"Frontsheet!R46","v":10},{"$f":"Frontsheet!S46","v":"Dam"}]
[{"$f":"IF(B20=\"\",\"\",CONCATENATE(\"|.\",B20,\"|=.\",C20,\"|=.\",D20,\"|=.\",E20,\"|=.\",F20,\"|=.\",G20,\"|=.\",H20,\"|=.\",I20,\"|=.\",J20,\"|=.\",K20,\"|=.\",L20,\"|=.\",M20,\"|=.\",N20,\"|=.\",O20,\"|\",P20&\"|\"))","v":"|.ºRondache|=.4|=.24|=.61|=.51|=.46|=.41|=.36|=.26|=.21|=.16|=.16|=.11|=.11|2d6|"},{"$f":"Frontsheet!A47","v":"ºRondache"},{"$f":"Frontsheet!F47","v":4},{"$f":"Frontsheet!G47","v":24},{"$f":"Frontsheet!H47","v":61},{"$f":"Frontsheet!I47","v":51},{"$f":"Frontsheet!J47","v":46},{"$f":"Frontsheet!K47","v":41},{"$f":"Frontsheet!L47","v":36},{"$f":"Frontsheet!M47","v":26},{"$f":"Frontsheet!N47","v":21},{"$f":"Frontsheet!O47","v":16},{"$f":"Frontsheet!P47","v":16},{"$f":"Frontsheet!Q47","v":11},{"$f":"Frontsheet!R47","v":11},{"$f":"Frontsheet!S47","v":"2d6"}]
[{"$f":"IF(B21=\"\",\"\",CONCATENATE(\"|_.\",B21,\"|_=.\",C21,\"|_=.Init|_=.\",E21,\"|_=.\",F21,\"|_=.\",G21,\"|_=.\",H21,\"|_=.\",I21,\"|_=.\",J21,\"|_=.\",K21,\"|_=.\",L21,\"|_=.\",M21,\"|_=.\",N21,\"|_=.\",O21,\"|_.Damage|\"))","v":"|_.Missile Weapons|_=.#B|_=.Init|_=.0|_=.1|_=.2|_=.3|_=.4|_=.5|_=.6|_=.7|_=.8|_=.9|_=.10|_.Damage|"},{"$f":"Frontsheet!A49","v":"Missile Weapons"},{"$f":"Frontsheet!F49","v":"#B"},{"$f":"Frontsheet!G49","v":"Int"},{"$f":"Frontsheet!H49","v":0},{"$f":"Frontsheet!I49","v":1},{"$f":"Frontsheet!J49","v":2},{"$f":"Frontsheet!K49","v":3},{"$f":"Frontsheet!L49","v":4},{"$f":"Frontsheet!M49","v":5},{"$f":"Frontsheet!N49","v":6},{"$f":"Frontsheet!O49","v":7},{"$f":"Frontsheet!P49","v":8},{"$f":"Frontsheet!Q49","v":9},{"$f":"Frontsheet!R49","v":10},{"$f":"Frontsheet!S49","v":"Dam"}]
[{"$f":"IF(B22=\"\",\"\",CONCATENATE(\"|.\",B22,\"|=.\",C22,\"|=.\",D22,\"|=.\",E22,\"|=.\",F22,\"|=.\",G22,\"|=.\",H22,\"|=.\",I22,\"|=.\",J22,\"|=.\",K22,\"|=.\",L22,\"|=.\",M22,\"|=.\",N22,\"|=.\",O22,\"|\",P22&\"|\"))","v":"|.Heavy Crossbow|=.0.5|=.22|=.45|=.40|=.40|=.35|=.30|=.25|=.25|=.20|=.15|=.10|=.5|1d10+7|"},{"$f":"Frontsheet!A50","v":"Heavy Crossbow"},{"$f":"Frontsheet!F50","v":0.5},{"$f":"Frontsheet!G50","v":22},{"$f":"Frontsheet!H50","v":45},{"$f":"Frontsheet!I50","v":40},{"$f":"Frontsheet!J50","v":40},{"$f":"Frontsheet!K50","v":35},{"$f":"Frontsheet!L50","v":30},{"$f":"Frontsheet!M50","v":25},{"$f":"Frontsheet!N50","v":25},{"$f":"Frontsheet!O50","v":20},{"$f":"Frontsheet!P50","v":15},{"$f":"Frontsheet!Q50","v":10},{"$f":"Frontsheet!R50","v":5},{"$f":"Frontsheet!S50","v":"1d10+7"}]
[{"$f":"IF(B23=\"\",\"\",CONCATENATE(\"|.\",B23,\"|=.\",C23,\"|=.\",D23,\"|=.\",E23,\"|=.\",F23,\"|=.\",G23,\"|=.\",H23,\"|=.\",I23,\"|=.\",J23,\"|=.\",K23,\"|=.\",L23,\"|=.\",M23,\"|=.\",N23,\"|=.\",O23,\"|\",P23&\"|\"))","v":"|.Chakra|=.5|=.22|=.45|=.45|=.40|=.30|=.20|=.0|=.-10|=.-15|=.-20|=.-25|=.-35|1d3+(p)|"},{"$f":"Frontsheet!A51","v":"Chakra"},{"$f":"Frontsheet!F51","v":5},{"$f":"Frontsheet!G51","v":22},{"$f":"Frontsheet!H51","v":45},{"$f":"Frontsheet!I51","v":45},{"$f":"Frontsheet!J51","v":40},{"$f":"Frontsheet!K51","v":30},{"$f":"Frontsheet!L51","v":20},{"$f":"Frontsheet!M51","v":0},{"$f":"Frontsheet!N51","v":-10},{"$f":"Frontsheet!O51","v":-15},{"$f":"Frontsheet!P51","v":-20},{"$f":"Frontsheet!Q51","v":-25},{"$f":"Frontsheet!R51","v":-35},{"$f":"Frontsheet!S51","v":"1d3+(p)"}]
[{"$f":"IF(B24=\"\",\"\",CONCATENATE(\"|.\",B24,\"|=.\",C24,\"|=.\",D24,\"|=.\",E24,\"|=.\",F24,\"|=.\",G24,\"|=.\",H24,\"|=.\",I24,\"|=.\",J24,\"|=.\",K24,\"|=.\",L24,\"|=.\",M24,\"|=.\",N24,\"|=.\",O24,\"|\",P24&\"|\"))","v":"|.Composite bow|=.2|=.22|=.45|=.45|=.40|=.30|=.25|=.20|=.15|=.10|=.5|=.0|=.-5|1d10+5|"},{"$f":"Frontsheet!A52","v":"Composite bow"},{"$f":"Frontsheet!F52","v":2},{"$f":"Frontsheet!G52","v":22},{"$f":"Frontsheet!H52","v":45},{"$f":"Frontsheet!I52","v":45},{"$f":"Frontsheet!J52","v":40},{"$f":"Frontsheet!K52","v":30},{"$f":"Frontsheet!L52","v":25},{"$f":"Frontsheet!M52","v":20},{"$f":"Frontsheet!N52","v":15},{"$f":"Frontsheet!O52","v":10},{"$f":"Frontsheet!P52","v":5},{"$f":"Frontsheet!Q52","v":0},{"$f":"Frontsheet!R52","v":-5},{"$f":"Frontsheet!S52","v":"1d10+5"}]
[{"$f":"IF(B25=\"\",\"\",CONCATENATE(\"|_.\",B25,\"|=.\",C25,\"|=.\",D25,\"|=.\",E25,\"|=.\",F25,\"|=.\",G25,\"|=.\",H25,\"|=.\",I25,\"|=.\",J25,\"|=.\",K25,\"|=.\",L25,\"|=.\",M25,\"|=.\",N25,\"|=.\",O25,\"|\",P25&\"|\"))","v":"|_.Javelin|=.2|=.22|=.40|=.40|=.35|=.30|=.30|=.30|=.25|=.15|=.10|=.10|=.5|1d8|"},{"$f":"Frontsheet!A53","v":"Javelin"},{"$f":"Frontsheet!F53","v":2},{"$f":"Frontsheet!G53","v":22},{"$f":"Frontsheet!H53","v":40},{"$f":"Frontsheet!I53","v":40},{"$f":"Frontsheet!J53","v":35},{"$f":"Frontsheet!K53","v":30},{"$f":"Frontsheet!L53","v":30},{"$f":"Frontsheet!M53","v":30},{"$f":"Frontsheet!N53","v":25},{"$f":"Frontsheet!O53","v":15},{"$f":"Frontsheet!P53","v":10},{"$f":"Frontsheet!Q53","v":10},{"$f":"Frontsheet!R53","v":5},{"$f":"Frontsheet!S53","v":"1d8"}]
["|_.Skills|||_.Methods|||_.Spells/Miracles|_.Skl|_.Dff|_.Sav|_.Sta|",{"$f":"Frontsheet!T3","v":"Skills"},{"$f":"Frontsheet!Y3","v":0},{"$f":"Frontsheet!T17","v":"Methods"},{"$f":"Frontsheet!Z17","v":0},{"$f":"Frontsheet!T23","v":"Spells/Miracles"},{"$f":"Frontsheet!Z23","v":"Skl|Dff|Sav|Sta"}]
[{"$f":"CONCATENATE(\"|\",B27,\"|=.\",C27,\"||\",D27,\"|=.\",E27,\"||\",F27,\"|=.\",G27,\"|\")","v":"|Two Edge Blades|=.2||Ritual Method|=.1||Protection from Evil (M)|=.1|d3|-|2|"},{"$f":"Frontsheet!T4","v":"Two Edge Blades"},{"$f":"Frontsheet!Y4","v":2},{"$f":"Frontsheet!T18","v":"Ritual Method"},{"$f":"Frontsheet!Z18","v":1},{"$f":"Frontsheet!T24","v":"Protection from Evil (M)"},{"$f":"Frontsheet!Z24","v":"1|d3|-|2"}]
["|Mounted Lance|=.1|||=.||Protection from Magic (M)|=.1|d4|-|4|",{"$f":"Frontsheet!T5","v":"Mounted Lance"},{"$f":"Frontsheet!Y5","v":1},{"$f":"Frontsheet!T19","v":""},{"$f":"Frontsheet!Z19","v":""},{"$f":"Frontsheet!T25","v":"Protection from Magic (M)"},{"$f":"Frontsheet!Z25","v":"1|d4|-|4"}]
["|Single Edge Blades|=.1|||=.|||=.|",{"$f":"Frontsheet!T6","v":"Single Edge Blades"},{"$f":"Frontsheet!Y6","v":1},{"$f":"Frontsheet!T20","v":""},{"$f":"Frontsheet!Z20","v":""},{"$f":"Frontsheet!T26","v":""},{"$f":"Frontsheet!Z26","v":""}]
["|Shields|=.2|||=.|||=.|",{"$f":"Frontsheet!T7","v":"Shields"},{"$f":"Frontsheet!Y7","v":2},{"$f":"Frontsheet!T21","v":""},{"$f":"Frontsheet!Z21","v":""},{"$f":"Frontsheet!T27","v":""},{"$f":"Frontsheet!Z27","v":""}]
["|Dodge|=.1|||=.|||=.|",{"$f":"Frontsheet!T8","v":"Dodge"},{"$f":"Frontsheet!Y8","v":1},{"$f":"Frontsheet!T22","v":""},{"$f":"Frontsheet!Z22","v":""},{"$f":"Frontsheet!T28","v":""},{"$f":"Frontsheet!Z28","v":""}]
["|Tackle|=.1|||=.|||=.|",{"$f":"Frontsheet!T9","v":"Tackle"},{"$f":"Frontsheet!Y9","v":1},null,null,{"$f":"Frontsheet!T29","v":""},{"$f":"Frontsheet!Z29","v":""}]
["|Grapple|=.1|||=.|||=.|",{"$f":"Frontsheet!T10","v":"Grapple"},{"$f":"Frontsheet!Y10","v":1},null,null,{"$f":"Frontsheet!T30","v":""},{"$f":"Frontsheet!Z30","v":""}]
["|Chirurgery|=.1|||=.|||=.|",{"$f":"Frontsheet!T11","v":"Chirurgery"},{"$f":"Frontsheet!Y11","v":1},null,null,{"$f":"Frontsheet!T31","v":""},{"$f":"Frontsheet!Z31","v":""}]
["|Military Engineer|=.1|||=.|||=.|",{"$f":"Frontsheet!T12","v":"Military Engineer"},{"$f":"Frontsheet!Y12","v":1},null,null,{"$f":"Frontsheet!T32","v":""},{"$f":"Frontsheet!Z32","v":""}]
["|Service|=.1|||=.|||=.|",{"$f":"Frontsheet!T13","v":"Service"},{"$f":"Frontsheet!Y13","v":1},null,null,{"$f":"Frontsheet!T33","v":""},{"$f":"Frontsheet!Z33","v":""}]
["|Armory|=.1|||=.|||=.|",{"$f":"Frontsheet!T14","v":"Armory"},{"$f":"Frontsheet!Y14","v":1},null,null,{"$f":"Frontsheet!T34","v":""},{"$f":"Frontsheet!Z34","v":""}]
["|Riding|=.1|||=.|||=.|",{"$f":"Frontsheet!T15","v":"Riding"},{"$f":"Frontsheet!Y15","v":1},null,null,{"$f":"Frontsheet!T35","v":""},{"$f":"Frontsheet!Z35","v":""}]
["|Finance|=.1|||=.|||=.|",{"$f":"Frontsheet!T16","v":"Finance"},{"$f":"Frontsheet!Y16","v":1},null,null,{"$f":"Frontsheet!T36","v":""},{"$f":"Frontsheet!Z36","v":""}]

{"sheet":"Revisions","index":9,"n_rows":14,"n_cols":4,"rows_kept":14}
["Credits:","Benjamin Holty; Design, Data Entry, Programming 1986-1995, 2005-2014"]
[null,"Bruce Dain; Programming 1995-2005"]
[null,"Special thanks to Bruce for all his hard work on this project. His programming expertise was instrumental in bringing many of the more powerful data processes to life. (Even though he occassionally had ulterior motives in changing the root formulas of the system.)"]
[]
["REVISIONS: "]
[]
[4.1,"Some general corrections to formulas, DEL Bruce frontsheet","2012-08-10","BWH"]
[null,"Char Equip: ADD chooser menus for armor and weapons "]
[null,"Char Stats: ADD chooser menu for Skill Cluster"]
[]
["4.2 B","Tables: Weapon Bonus; Flails, ADD Hammers, DEL Lance","2014-03-24","BWH"]
[null,"Char Stats: Wisdom/Strength Range Limits"]
[null,"ID: Weaponless Combat tables."]
[null,"Char Stats: Del Miracle cheat"]